{"text_format":"1","workbook":"xlsx","n_sheets":3,"sheets":["スコア","点差計算","点差推移"],"not_rendered":{"charts":1,"images":2,"macros":1,"external_links":0,"defined_names":0,"comments":0,"pivot_tables":0},"unopened":[],"bounds":{"document_bytes":16777216,"sheet_cells":100000,"rows_first":2000,"rows_last":500,"rows_between":2000,"halvings":0,"cell_chars":16384,"cell_head_chars":4096},"cells_cut":0,"cells_raw":0,"read":"whole","date_system":"1900"}

{"sheet":"スコア","index":0,"n_rows":108,"n_cols":159,"rows_kept":108,"cut":false,"hidden":false,"merged":[[1,3,1,97],[4,2,5,2],[14,2,15,2],[24,2,25,2],[34,2,35,2],[44,2,45,2],[83,108,83,131],[84,108,84,109],[84,110,84,113],[84,114,84,115],[84,116,84,119],[84,120,84,121],[84,122,84,125],[84,126,84,131],[85,108,85,109],[85,110,85,113],[85,114,85,115],[85,116,85,119],[85,120,85,121],[85,122,85,125],[85,126,85,127],[85,128,85,131],[64,120,64,121],[64,122,64,125],[64,126,64,131],[65,108,65,109],[65,110,65,113],[65,114,65,115],[65,116,65,119],[65,120,65,121],[65,122,65,125],[65,126,65,127],[65,128,65,131],[73,108,73,131],[74,108,74,109],[74,110,74,113],[74,114,74,115],[74,116,74,119],[74,120,74,121],[74,122,74,125],[74,126,74,131],[67,114,67,115],[67,116,67,117],[67,118,67,119],[67,120,67,121],[71,120,71,121],[64,108,64,109],[64,110,64,113],[64,114,64,115],[64,116,64,119],[67,108,67,109],[67,110,67,111],[69,116,69,117],[69,118,69,119],[70,117,70,118],[45,122,45,125],[45,126,45,127],[45,128,45,131],[53,108,53,131],[54,108,54,109],[54,110,54,113],[54,114,54,115],[54,116,54,119],[54,120,54,121],[54,122,54,125],[54,126,54,131],[55,108,55,109],[55,110,55,113],[55,114,55,115],[55,116,55,119],[55,120,55,121],[55,122,55,125],[55,126,55,127],[55,128,55,131],[47,114,47,115],[47,116,47,117],[47,118,47,119],[47,120,47,121],[49,108,49,109],[49,116,49,117],[49,118,49,119],[47,108,47,109],[47,110,47,111],[50,117,50,118],[34,126,34,131],[35,108,35,109],[35,110,35,113],[35,114,35,115],[35,116,35,119],[35,120,35,121],[35,122,35,125],[35,126,35,127],[35,128,35,131],[43,108,43,131],[44,108,44,109],[44,110,44,113],[44,114,44,115],[44,116,44,119],[44,120,44,121],[44,122,44,125],[44,126,44,131],[34,122,34,125],[37,108,37,109],[37,110,37,111],[41,120,41,121],[41,114,41,115],[41,110,41,111],[24,122,24,125],[24,126,24,131],[25,108,25,109],[25,110,25,113],[25,114,25,115],[25,116,25,119],[25,120,25,121],[25,122,25,125],[25,126,25,127],[25,128,25,131],[23,108,23,131],[13,108,13,131],[3,108,3,131],[33,108,33,131],[4,122,4,125],[4,126,4,131],[14,108,14,109],[14,110,14,113],[14,114,14,115],[14,116,14,119],[14,120,14,121],[14,122,14,125],[14,126,14,131],[15,108,15,109],[15,110,15,113],[15,114,15,115],[15,116,15,119],[15,120,15,121],[15,122,15,125],[15,126,15,127],[15,128,15,131],[4,108,4,109],[5,116,5,119],[5,114,5,115],[5,110,5,113],[5,108,5,109],[5,122,5,125],[5,120,5,121],[4,110,4,113],[4,114,4,115],[4,116,4,119],[4,120,4,121],[5,126,5,127],[5,128,5,131],[11,14,11,15],[11,114,11,115],[11,104,11,105],[11,94,11,95],[11,84,11,85],[11,74,11,75],[11,64,11,65],[11,54,11,55],[11,44,11,45],[11,34,11,35],[11,24,11,25],[11,90,11,91],[11,100,11,101],[11,110,11,111],[8,15,8,16],[8,17,8,18],[4,103,4,107],[5,23,5,32],[7,44,7,45],[9,28,9,29],[51,10,51,11],[51,20,51,21],[51,30,51,31],[51,40,51,41],[51,50,51,51],[51,60,51,61],[51,70,51,71],[51,80,51,81],[51,90,51,91],[51,100,51,101],[51,110,51,111],[51,120,51,121],[11,120,11,121],[21,10,21,11],[21,20,21,21],[21,30,21,31],[21,40,21,41],[21,50,21,51],[21,60,21,61],[21,70,21,71],[21,80,21,81],[21,90,21,91],[24,114,24,115],[24,116,24,119],[24,120,24,121],[45,116,45,119],[45,120,45,121],[45,108,45,109],[45,110,45,113],[45,114,45,115],[45,3,45,12],[45,13,45,22],[11,4,11,5],[8,5,8,6],[21,100,21,101],[10,7,10,8],[9,8,9,9],[9,6,9,7],[8,9,8,10],[8,7,8,8],[11,20,11,21],[11,30,11,31],[11,40,11,41],[11,50,11,51],[11,60,11,61],[11,70,11,71],[11,80,11,81],[10,37,10,38],[10,47,10,48],[11,10,11,11],[8,35,8,36],[8,37,8,38],[10,17,10,18],[9,18,9,19],[10,67,10,68],[10,77,10,78],[8,65,8,66],[8,67,8,68],[8,69,8,70],[9,56,9,57],[9,16,9,17],[8,25,8,26],[8,19,8,20],[10,27,10,28],[21,120,21,121],[31,10,31,11],[31,20,31,21],[31,30,31,31],[31,40,31,41],[31,50,31,51],[31,60,31,61],[31,70,31,71],[31,80,31,81],[31,90,31,91],[31,100,31,101],[31,110,31,111],[13,63,13,72],[13,73,13,82],[17,118,17,119],[17,90,17,91],[17,94,17,95],[13,3,13,12],[13,13,13,22],[13,43,13,52],[13,23,13,32],[14,33,14,37],[14,38,14,42],[14,43,14,47],[14,48,14,52],[14,73,14,77],[14,78,14,82],[14,83,14,87],[14,88,14,92],[15,93,15,107],[14,53,14,57],[14,58,14,62],[3,83,3,92],[4,88,4,92],[4,93,4,97],[4,98,4,102],[4,58,4,62],[4,63,4,67],[4,68,4,72],[7,10,7,11],[5,3,5,12],[5,83,5,92],[5,93,5,107],[4,18,4,22],[4,13,4,17],[4,8,4,12],[4,3,4,7],[4,23,4,27],[5,53,5,62],[5,43,5,52],[5,33,5,42],[7,20,7,21],[7,18,7,19],[7,16,7,17],[7,54,7,55],[7,74,7,75],[7,76,7,77],[7,64,7,65],[7,66,7,67],[7,68,7,69],[7,70,7,71],[7,48,7,49],[7,50,7,51],[4,83,4,87],[9,26,9,27],[8,27,8,28],[8,29,8,30],[3,13,3,22],[3,3,3,12],[3,23,3,32],[3,33,3,42],[3,43,3,52],[3,53,3,62],[3,63,3,72],[3,73,3,82],[7,30,7,31],[7,28,7,29],[7,26,7,27],[7,24,7,25],[4,73,4,77],[4,78,4,82],[4,28,4,32],[4,33,4,37],[4,38,4,42],[4,43,4,47],[4,48,4,52],[4,53,4,57],[8,39,8,40],[7,8,7,9],[7,6,7,7],[7,4,7,5],[7,14,7,15],[7,78,7,79],[5,13,5,22],[5,73,5,82],[5,63,5,72],[9,36,9,37],[9,38,9,39],[7,80,7,81],[8,75,8,76],[8,77,8,78],[8,79,8,80],[8,55,8,56],[8,57,8,58],[7,46,7,47],[7,34,7,35],[7,36,7,37],[7,38,7,39],[7,40,7,41],[7,94,7,95],[9,58,9,59],[10,57,10,58],[7,56,7,57],[7,58,7,59],[7,60,7,61],[13,93,13,107],[14,93,14,97],[14,98,14,102],[14,103,14,107],[14,63,14,67],[14,68,14,72],[8,45,8,46],[8,47,8,48],[8,49,8,50],[9,46,9,47],[9,48,9,49],[7,100,7,101],[8,95,8,96],[8,97,8,98],[8,99,8,100],[7,84,7,85],[7,86,7,87],[7,88,7,89],[7,90,7,91],[8,85,8,86],[8,87,8,88],[8,89,8,90],[9,86,9,87],[9,88,9,89],[9,76,9,77],[9,78,9,79],[9,66,9,67],[9,68,9,69],[8,59,8,60],[18,55,18,56],[18,57,18,58],[10,87,10,88],[8,115,8,116],[8,117,8,118],[8,119,8,120],[9,116,9,117],[9,118,9,119],[10,117,10,118],[8,105,8,106],[8,107,8,108],[8,109,8,110],[9,106,9,107],[9,108,9,109],[9,98,9,99],[10,97,10,98],[7,104,7,105],[7,106,7,107],[7,108,7,109],[10,107,10,108],[7,110,7,111],[7,96,7,97],[7,98,7,99],[9,96,9,97],[7,120,7,121],[18,85,18,86],[18,87,18,88],[18,89,18,90],[15,73,15,82],[17,106,17,107],[17,108,17,109],[17,110,17,111],[15,33,15,42],[15,43,15,52],[15,83,15,92],[15,53,15,62],[13,83,13,92],[13,33,13,42],[13,53,13,62],[14,3,14,7],[14,8,14,12],[14,13,14,17],[14,18,14,22],[14,23,14,27],[14,28,14,32],[17,16,17,17],[17,18,17,19],[17,20,17,21],[17,24,17,25],[17,26,17,27],[17,28,17,29],[17,30,17,31],[17,34,17,35],[17,36,17,37],[17,38,17,39],[17,4,17,5],[17,6,17,7],[17,8,17,9],[17,10,17,11],[17,14,17,15],[15,3,15,12],[15,13,15,22],[15,23,15,32],[15,63,15,72],[18,5,18,6],[18,7,18,8],[18,9,18,10],[20,7,20,8],[20,17,20,18],[20,27,20,28],[17,40,17,41],[17,44,17,45],[17,96,17,97],[17,98,17,99],[17,100,17,101],[17,104,17,105],[17,46,17,47],[17,48,17,49],[17,50,17,51],[17,54,17,55],[17,56,17,57],[17,58,17,59],[17,76,17,77],[17,78,17,79],[17,80,17,81],[17,84,17,85],[17,86,17,87],[17,88,17,89],[17,60,17,61],[17,64,17,65],[17,66,17,67],[17,68,17,69],[17,70,17,71],[17,74,17,75],[20,37,20,38],[20,47,20,48],[19,6,19,7],[19,8,19,9],[19,16,19,17],[19,18,19,19],[19,26,19,27],[19,28,19,29],[19,36,19,37],[20,67,20,68],[20,77,20,78],[20,87,20,88],[18,59,18,60],[18,65,18,66],[18,67,18,68],[18,69,18,70],[18,35,18,36],[18,37,18,38],[18,39,18,40],[18,45,18,46],[18,47,18,48],[18,49,18,50],[18,29,18,30],[18,15,18,16],[18,17,18,18],[18,19,18,20],[18,25,18,26],[18,27,18,28],[19,68,19,69],[19,76,19,77],[19,78,19,79],[19,86,19,87],[19,88,19,89],[18,79,18,80],[19,96,19,97],[19,38,19,39],[19,46,19,47],[19,48,19,49],[19,56,19,57],[19,58,19,59],[19,66,19,67],[17,120,17,121],[20,117,20,118],[23,156,23,158],[13,138,13,139],[21,14,21,15],[13,140,13,141],[20,57,20,58],[19,98,19,99],[19,106,19,107],[19,108,19,109],[20,97,20,98],[20,107,20,108],[19,116,19,117],[19,118,19,119],[18,115,18,116],[18,117,18,118],[18,119,18,120],[18,95,18,96],[18,97,18,98],[18,99,18,100],[18,105,18,106],[18,107,18,108],[18,109,18,110],[18,75,18,76],[18,77,18,78],[13,148,13,149],[13,150,13,151],[13,152,13,153],[13,154,13,155],[13,156,13,158],[3,148,3,149],[3,150,3,151],[3,152,3,153],[3,154,3,155],[3,156,3,158],[13,142,13,143],[13,144,13,145],[13,146,13,147],[3,138,3,139],[3,140,3,141],[3,142,3,143],[3,144,3,145],[3,146,3,147],[17,114,17,115],[17,116,17,117],[3,93,3,107],[7,114,7,115],[7,116,7,117],[7,118,7,119],[23,83,23,92],[23,93,23,107],[24,83,24,87],[24,88,24,92],[24,93,24,97],[23,3,23,12],[23,13,23,22],[23,23,23,32],[23,33,23,42],[23,43,23,52],[23,53,23,62],[23,63,23,72],[23,73,23,82],[24,3,24,7],[24,8,24,12],[24,13,24,17],[24,18,24,22],[24,23,24,27],[24,28,24,32],[24,33,24,37],[24,38,24,42],[24,43,24,47],[24,48,24,52],[24,53,24,57],[24,58,24,62],[24,63,24,67],[27,4,27,5],[27,6,27,7],[27,8,27,9],[27,10,27,11],[27,14,27,15],[27,16,27,17],[27,18,27,19],[27,20,27,21],[24,103,24,107],[25,3,25,12],[25,13,25,22],[25,23,25,32],[25,33,25,42],[25,43,25,52],[25,53,25,62],[25,63,25,72],[25,73,25,82],[30,7,30,8],[30,17,30,18],[30,27,30,28],[30,37,30,38],[27,110,27,111],[27,68,27,69],[27,70,27,71],[27,74,27,75],[27,76,27,77],[27,78,27,79],[27,80,27,81],[27,84,27,85],[27,86,27,87],[27,88,27,89],[27,46,27,47],[27,48,27,49],[27,50,27,51],[27,54,27,55],[27,56,27,57],[27,58,27,59],[27,60,27,61],[27,64,27,65],[27,66,27,67],[30,57,30,58],[30,67,30,68],[30,77,30,78],[30,87,30,88],[29,68,29,69],[29,76,29,77],[29,78,29,79],[27,24,27,25],[27,26,27,27],[28,5,28,6],[28,7,28,8],[28,9,28,10],[28,15,28,16],[28,17,28,18],[28,19,28,20],[28,25,28,26],[28,27,28,28],[28,29,28,30],[28,35,28,36],[28,37,28,38],[28,39,28,40],[28,45,28,46],[28,47,28,48],[28,49,28,50],[28,55,28,56],[28,57,28,58],[29,116,29,117],[29,118,29,119],[29,98,29,99],[27,114,27,115],[27,116,27,117],[27,118,27,119],[33,23,33,32],[33,33,33,42],[33,43,33,52],[33,53,33,62],[33,63,33,72],[33,73,33,82],[33,83,33,92],[33,93,33,107],[27,120,27,121],[28,59,28,60],[28,65,28,66],[28,67,28,68],[27,90,27,91],[27,94,27,95],[27,96,27,97],[27,98,27,99],[27,100,27,101],[27,104,27,105],[27,106,27,107],[27,108,27,109],[31,120,31,121],[29,106,29,107],[29,108,29,109],[28,99,28,100],[28,105,28,106],[27,28,27,29],[31,4,31,5],[31,14,31,15],[34,108,34,109],[34,110,34,113],[34,114,34,115],[34,116,34,119],[34,120,34,121],[28,115,28,116],[28,117,28,118],[28,119,28,120],[29,6,29,7],[29,8,29,9],[29,16,29,17],[29,18,29,19],[29,26,29,27],[29,28,29,29],[29,36,29,37],[29,38,29,39],[29,46,29,47],[29,48,29,49],[29,56,29,57],[29,58,29,59],[29,66,29,67],[29,86,29,87],[28,69,28,70],[28,75,28,76],[28,77,28,78],[28,79,28,80],[28,85,28,86],[28,87,28,88],[28,89,28,90],[28,95,28,96],[35,3,35,12],[35,13,35,22],[35,23,35,32],[35,33,35,42],[35,43,35,52],[35,53,35,62],[35,63,35,72],[35,73,35,82],[35,83,35,92],[35,93,35,107],[34,3,34,7],[34,8,34,12],[34,13,34,17],[34,18,34,22],[34,23,34,27],[34,28,34,32],[34,33,34,37],[34,38,34,42],[34,43,34,47],[34,48,34,52],[34,53,34,57],[34,58,34,62],[34,63,34,67],[34,68,34,72],[34,73,34,77],[34,78,34,82],[34,83,34,87],[34,88,34,92],[34,93,34,97],[34,98,34,102],[34,103,34,107],[37,24,37,25],[37,26,37,27],[37,28,37,29],[37,30,37,31],[37,34,37,35],[37,36,37,37],[37,38,37,39],[37,40,37,41],[37,44,37,45],[37,4,37,5],[37,6,37,7],[37,8,37,9],[37,10,37,11],[37,14,37,15],[37,16,37,17],[37,18,37,19],[37,20,37,21],[37,68,37,69],[37,70,37,71],[37,74,37,75],[37,76,37,77],[37,78,37,79],[37,80,37,81],[37,84,37,85],[37,86,37,87],[37,88,37,89],[37,46,37,47],[37,48,37,49],[37,50,37,51],[37,54,37,55],[37,56,37,57],[37,58,37,59],[37,60,37,61],[37,64,37,65],[37,66,37,67],[38,97,38,98],[37,114,37,115],[37,116,37,117],[37,118,37,119],[37,120,37,121],[38,5,38,6],[38,7,38,8],[38,9,38,10],[38,15,38,16],[38,17,38,18],[38,19,38,20],[38,25,38,26],[38,27,38,28],[38,29,38,30],[38,35,38,36],[38,37,38,38],[38,39,38,40],[38,45,38,46],[38,47,38,48],[38,49,38,50],[38,55,38,56],[38,57,38,58],[38,59,38,60],[38,65,38,66],[38,67,38,68],[37,90,37,91],[37,94,37,95],[37,96,37,97],[37,98,37,99],[37,100,37,101],[37,104,37,105],[37,106,37,107],[38,99,38,100],[38,105,38,106],[38,107,38,108],[38,109,38,110],[38,115,38,116],[38,117,38,118],[38,119,38,120],[39,6,39,7],[39,8,39,9],[39,16,39,17],[39,18,39,19],[39,26,39,27],[39,28,39,29],[39,36,39,37],[39,38,39,39],[39,46,39,47],[39,48,39,49],[39,56,39,57],[39,58,39,59],[39,66,39,67],[39,68,39,69],[39,76,39,77],[39,78,39,79],[39,86,39,87],[38,69,38,70],[38,75,38,76],[38,77,38,78],[38,79,38,80],[38,85,38,86],[38,87,38,88],[38,89,38,90],[38,95,38,96],[39,88,39,89],[39,96,39,97],[39,98,39,99],[39,106,39,107],[39,108,39,109],[39,116,39,117],[39,118,39,119],[40,7,40,8],[40,17,40,18],[40,27,40,28],[40,37,40,38],[40,47,40,48],[40,57,40,58],[40,67,40,68],[40,77,40,78],[40,87,40,88],[44,93,44,97],[44,98,44,102],[44,103,44,107],[40,97,40,98],[40,107,40,108],[40,117,40,118],[43,3,43,12],[43,13,43,22],[43,23,43,32],[43,33,43,42],[43,43,43,52],[43,53,43,62],[43,63,43,72],[43,73,43,82],[43,83,43,92],[41,100,41,101],[44,3,44,7],[44,8,44,12],[44,13,44,17],[44,18,44,22],[44,23,44,27],[44,28,44,32],[44,33,44,37],[44,38,44,42],[44,43,44,47],[44,48,44,52],[44,53,44,57],[44,58,44,62],[44,63,44,67],[44,68,44,72],[44,73,44,77],[44,78,44,82],[43,93,43,107],[41,20,41,21],[41,30,41,31],[41,40,41,41],[41,50,41,51],[41,60,41,61],[41,70,41,71],[41,80,41,81],[44,83,44,87],[44,88,44,92],[41,4,41,5],[47,4,47,5],[47,6,47,7],[47,8,47,9],[47,10,47,11],[47,14,47,15],[47,16,47,17],[47,18,47,19],[47,20,47,21],[41,14,41,15],[41,24,41,25],[41,34,41,35],[41,44,41,45],[41,54,41,55],[41,64,41,65],[41,74,41,75],[41,84,41,85],[47,50,47,51],[47,54,47,55],[47,56,47,57],[47,58,47,59],[47,60,47,61],[47,64,47,65],[41,94,41,95],[45,23,45,32],[45,33,45,42],[45,43,45,52],[45,53,45,62],[45,63,45,72],[45,73,45,82],[45,83,45,92],[45,93,45,107],[47,98,47,99],[47,100,47,101],[47,104,47,105],[47,106,47,107],[41,104,41,105],[41,10,41,11],[41,90,41,91],[51,4,51,5],[51,14,51,15],[51,24,51,25],[51,34,51,35],[51,44,51,45],[47,68,47,69],[47,70,47,71],[47,74,47,75],[47,76,47,77],[47,78,47,79],[47,80,47,81],[47,84,47,85],[47,86,47,87],[47,88,47,89],[47,46,47,47],[47,48,47,49],[47,66,47,67],[48,97,48,98],[48,5,48,6],[48,7,48,8],[48,9,48,10],[48,15,48,16],[48,17,48,18],[48,19,48,20],[48,25,48,26],[48,27,48,28],[48,29,48,30],[48,35,48,36],[48,37,48,38],[48,39,48,40],[48,45,48,46],[48,47,48,48],[48,49,48,50],[48,55,48,56],[48,57,48,58],[48,59,48,60],[48,65,48,66],[48,67,48,68],[47,90,47,91],[47,94,47,95],[47,96,47,97],[48,85,48,86],[48,87,48,88],[48,89,48,90],[48,95,48,96],[47,24,47,25],[47,26,47,27],[47,28,47,29],[47,30,47,31],[47,34,47,35],[47,36,47,37],[47,38,47,39],[47,40,47,41],[47,44,47,45]],"merged_total":2132,"flags":["merged_cut"]}
[]
[null,"2017/X/XX",null,"第X回 関西学生X季リーグ戦 第X週 (vs. XX大学)",null,null,null,null,null,null,null,null,null,null,null,null,null,null,null,null,null,null,null,null,null,null,null,null,null,null,null,null,null,null,null,null,null,null,null,null,null,null,null,null,null,null,null,null,null,null,null,null,null,null,null,null,null,null,null,null,null,null,null,null,null,null,null,null,null,null,null,null,null,null,null,null,null,null,null,null,null,null,null,null,null,null,null,null,null,null,null,null,null,null,null,null,null,null,null,null,null,null,null,"XXXボウル"]
[null,null,null,4,5,6,7,8,9,10,11,12,13,14,15,16,17,18,19,20,21,22,23,24,25,26,27,28,29,30,31,32,33,34,35,36,37,38,39,40,41,42,43,44,45,46,47,48,49,50,51,52,53,54,55,56,57,58,59,60,61,62,63,64,65,66,67,68,69,70,71,72,73,74,75,76,77,78,79,80,81,82,83,84,85,86,87,88,89,90,91,92,93,94,95,96,97,98,99,100,101,102,103,null,null,null,null,null,null,null,null,null,null,null,null,null,null,null,null,null,null,null,null,null,null,null,null,null,null,null,null,null,null,null,"1○","1○","P"]
[null,"京　都　大　学","Player 1",1,null,null,null,null,null,null,null,null,null,2,null,null,null,null,null,null,null,null,null,3,null,null,null,null,null,null,null,null,null,4,null,null,null,null,null,null,null,null,null,5,null,null,null,null,null,null,null,null,null,6,null,null,null,null,null,null,null,null,null,7,null,null,null,null,null,null,null,null,null,8,null,null,null,null,null,null,null,null,null,9,null,null,null,null,null,null,null,null,null,10,null,null,null,null,null,null,null,null,null,null,null,null,null,null,null,null,null,null,null,null,null,null,null,null,null,null,null,null,null,null,null,null,null,null,null,null,null,null,null,null,"1F","1F","S",null,1,null,2,null,3,null,4,null,5,null,6,null,7,null,8,null,9,null,10]
[null,null,null,{"$f":"IF(EI5=10,\"X\",IF(AND(EI5=0,OR(E12=\"1F\",E12=\"1,2F\")),\"F\",IF(EI5=0,\"G\",IF(AND(EI5=8,E12=\"1○\"),\"⑧\",IF(AND(EI5=7,E12=\"1○\"),\"⑦\",IF(AND(EI5=6,E12=\"1○\"),\"⑥\",IF(AND(EI5=5,E12=\"1○\"),\"⑤\",IF(AND(EI5=4,E12=\"1○\"),\"④\",EI5))))))))","v":"X"},null,null,null,null,{"$f":"IF(AND(EI5<10,EI5+EJ5=10),\"/\",IF(EI5=10,\"\",IF(OR(AND(EJ5=0,E12=\"2F\"),AND(EJ5=0,E12=\"1,2F\")),\"F\",IF(EJ5=0,\"-\",EJ5))))","v":""},null,null,null,null,{"$f":"IF(EK5=10,\"X\",IF(AND(EK5=0,OR(O12=\"1F\",O12=\"1,2F\")),\"F\",IF(EK5=0,\"G\",IF(AND(EK5=8,O12=\"1○\"),\"⑧\",IF(AND(EK5=7,O12=\"1○\"),\"⑦\",IF(AND(EK5=6,O12=\"1○\"),\"⑥\",IF(AND(EK5=5,O12=\"1○\"),\"⑤\",IF(AND(EK5=4,O12=\"1○\"),\"④\",EK5))))))))","v":"X"},null,null,null,null,{"$f":"IF(AND(EK5<10,EK5+EL5=10),\"/\",IF(EK5=10,\"\",IF(OR(AND(EL5=0,O12=\"2F\"),AND(EL5=0,O12=\"1,2F\")),\"F\",IF(EL5=0,\"-\",EL5))))","v":""},null,null,null,null,{"$f":"IF(EM5=10,\"X\",IF(AND(EM5=0,OR(Y12=\"1F\",Y12=\"1,2F\")),\"F\",IF(EM5=0,\"G\",IF(AND(EM5=8,Y12=\"1○\"),\"⑧\",IF(AND(EM5=7,Y12=\"1○\"),\"⑦\",IF(AND(EM5=6,Y12=\"1○\"),\"⑥\",IF(AND(EM5=5,Y12=\"1○\"),\"⑤\",IF(AND(EM5=4,Y12=\"1○\"),\"④\",EM5))))))))","v":"X"},null,null,null,null,{"$f":"IF(AND(EM5<10,EM5+EN5=10),\"/\",IF(EM5=10,\"\",IF(OR(AND(EN5=0,Y12=\"2F\"),AND(EN5=0,Y12=\"1,2F\")),\"F\",IF(EN5=0,\"-\",EN5))))","v":""},null,null,null,null,{"$f":"IF(EO5=10,\"X\",IF(AND(EO5=0,OR(AI12=\"1F\",AI12=\"1,2F\")),\"F\",IF(EO5=0,\"G\",IF(AND(EO5=8,AI12=\"1○\"),\"⑧\",IF(AND(EO5=7,AI12=\"1○\"),\"⑦\",IF(AND(EO5=6,AI12=\"1○\"),\"⑥\",IF(AND(EO5=5,AI12=\"1○\"),\"⑤\",IF(AND(EO5=4,AI12=\"1○\"),\"④\",EO5))))))))","v":"X"},null,null,null,null,{"$f":"IF(AND(EO5<10,EO5+EP5=10),\"/\",IF(EO5=10,\"\",IF(OR(AND(EP5=0,AI12=\"2F\"),AND(EP5=0,AI12=\"1,2F\")),\"F\",IF(EP5=0,\"-\",EP5))))","v":""},null,null,null,null,{"$f":"IF(EQ5=10,\"X\",IF(AND(EQ5=0,OR(AS12=\"1F\",AS12=\"1,2F\")),\"F\",IF(EQ5=0,\"G\",IF(AND(EQ5=8,AS12=\"1○\"),\"⑧\",IF(AND(EQ5=7,AS12=\"1○\"),\"⑦\",IF(AND(EQ5=6,AS12=\"1○\"),\"⑥\",IF(AND(EQ5=5,AS12=\"1○\"),\"⑤\",IF(AND(EQ5=4,AS12=\"1○\"),\"④\",EQ5))))))))","v":"X"},null,null,null,null,{"$f":"IF(AND(EQ5<10,EQ5+ER5=10),\"/\",IF(EQ5=10,\"\",IF(OR(AND(ER5=0,AS12=\"2F\"),AND(ER5=0,AS12=\"1,2F\")),\"F\",IF(ER5=0,\"-\",ER5))))","v":""},null,null,null,null,{"$f":"IF(ES5=10,\"X\",IF(AND(ES5=0,OR(BC12=\"1F\",BC12=\"1,2F\")),\"F\",IF(ES5=0,\"G\",IF(AND(ES5=8,BC12=\"1○\"),\"⑧\",IF(AND(ES5=7,BC12=\"1○\"),\"⑦\",IF(AND(ES5=6,BC12=\"1○\"),\"⑥\",IF(AND(ES5=5,BC12=\"1○\"),\"⑤\",IF(AND(ES5=4,BC12=\"1○\"),\"④\",ES5))))))))","v":"X"},null,null,null,null,{"$f":"IF(AND(ES5<10,ES5+ET5=10),\"/\",IF(ES5=10,\"\",IF(OR(AND(ET5=0,BC12=\"2F\"),AND(ET5=0,BC12=\"1,2F\")),\"F\",IF(ET5=0,\"-\",ET5))))","v":""},null,null,null,null,{"$f":"IF(EU5=10,\"X\",IF(AND(EU5=0,OR(BM12=\"1F\",BM12=\"1,2F\")),\"F\",IF(EU5=0,\"G\",IF(AND(EU5=8,BM12=\"1○\"),\"⑧\",IF(AND(EU5=7,BM12=\"1○\"),\"⑦\",IF(AND(EU5=6,BM12=\"1○\"),\"⑥\",IF(AND(EU5=5,BM12=\"1○\"),\"⑤\",IF(AND(EU5=4,BM12=\"1○\"),\"④\",EU5))))))))","v":"X"},null,null,null,null,{"$f":"IF(AND(EU5<10,EU5+EV5=10),\"/\",IF(EU5=10,\"\",IF(OR(AND(EV5=0,BM12=\"2F\"),AND(EV5=0,BM12=\"1,2F\")),\"F\",IF(EV5=0,\"-\",EV5))))","v":""},null,null,null,null,{"$f":"IF(EW5=10,\"X\",IF(AND(EW5=0,OR(BW12=\"1F\",BW12=\"1,2F\")),\"F\",IF(EW5=0,\"G\",IF(AND(EW5=8,BW12=\"1○\"),\"⑧\",IF(AND(EW5=7,BW12=\"1○\"),\"⑦\",IF(AND(EW5=6,BW12=\"1○\"),\"⑥\",IF(AND(EW5=5,BW12=\"1○\"),\"⑤\",IF(AND(EW5=4,BW12=\"1○\"),\"④\",EW5))))))))","v":"X"},null,null,null,null,{"$f":"IF(AND(EW5<10,EW5+EX5=10),\"/\",IF(EW5=10,\"\",IF(OR(AND(EX5=0,BW12=\"2F\"),AND(EX5=0,BW12=\"1,2F\")),\"F\",IF(EX5=0,\"-\",EX5))))","v":""},null,null,null,null,{"$f":"IF(EY5=10,\"X\",IF(AND(EY5=0,OR(CG12=\"1F\",CG12=\"1,2F\")),\"F\",IF(EY5=0,\"G\",IF(AND(EY5=8,CG12=\"1○\"),\"⑧\",IF(AND(EY5=7,CG12=\"1○\"),\"⑦\",IF(AND(EY5=6,CG12=\"1○\"),\"⑥\",IF(AND(EY5=5,CG12=\"1○\"),\"⑤\",IF(AND(EY5=4,CG12=\"1○\"),\"④\",EY5))))))))","v":"X"},null,null,null,null,{"$f":"IF(AND(EY5<10,EY5+EZ5=10),\"/\",IF(EY5=10,\"\",IF(OR(AND(EZ5=0,CG12=\"2F\"),AND(EZ5=0,CG12=\"1,2F\")),\"F\",IF(EZ5=0,\"-\",EZ5))))","v":""},null,null,null,null,{"$f":"IF(FA5=10,\"X\",IF(AND(FA5=0,OR(CQ12=\"1F\",CQ12=\"1,2F\")),\"F\",IF(FA5=0,\"G\",IF(AND(FA5=8,CQ12=\"1○\"),\"⑧\",IF(AND(FA5=7,CQ12=\"1○\"),\"⑦\",IF(AND(FA5=6,CQ12=\"1○\"),\"⑥\",IF(AND(FA5=5,CQ12=\"1○\"),\"⑤\",IF(AND(FA5=4,CQ12=\"1○\"),\"④\",FA5))))))))","v":"X"},null,null,null,null,{"$f":"IF(AND(FA5=10,FB5=10),\"X\",IF(AND(FA5<10,FA5+FB5=10),\"/\",IF(OR(AND(FA5=10,FB5=0,DA12=\"1F\"),AND(FA5=10,FB5=0,DA12=\"1,2F\")),\"F\",IF(AND(FA5=10,FB5=0),\"G\",IF(AND(FA5=10,FB5=8,DA12=\"1○\"),\"⑧\",IF(AND(FA5=10,FB5=7,DA12=\"1○\"),\"⑦\",IF(AND(FA5=10,FB5=6,DA12=\"1○\"),\"⑥\",IF(AND(FA5=10,FB5=5,DA12=\"1○\"),\"⑤\",IF(AND(FA5=10,FB5=4,DA12=\"1○\"),\"④\",IF(AND(FA5=10,FB5<10),FB5,IF(OR(AND(FA5<10,FB5=0,CQ12=\"2F\"),AND(FA5<10,FB5=0,CQ12=\"1,2F\")),\"F\",IF(AND(FA5<10,FB5=0),\"-\",FB5))))))))))))","v":"X"},null,null,null,null,{"$f":"IF(FC5=10,\"X\",IF(OR(AND(FB5=10,FC5=8,DK12=\"1○\"),AND(FA5+FB5=10,FC5=8,DA12=\"1○\")),\"⑧\",IF(OR(AND(FB5=10,FC5=7,DK12=\"1○\"),AND(FA5+FB5=10,FC5=7,DA12=\"1○\")),\"⑦\",IF(OR(AND(FB5=10,FC5=6,DK12=\"1○\"),AND(FA5+FB5=10,FC5=6,DA12=\"1○\")),\"⑥\",IF(OR(AND(FB5=10,FC5=5,DK12=\"1○\"),AND(FA5+FB5=10,FC5=5,DA12=\"1○\")),\"⑤\",IF(OR(AND(FB5=10,FC5=4,DK12=\"1○\"),AND(FA5+FB5=10,FC5=4,DA12=\"1○\")),\"④\",IF(OR(AND(FB5=10,FC5=0,DK12=\"1F\"),AND(FB5<10,FC5=0,DA12=\"2F\"),AND(FB5<10,FC5=0,DA12=\"1,2F\")),\"F\",IF(AND(FA5=10,FB5<10,FB5+FC5=10),\"/\",IF(AND(OR(FB5=10,AND(FA5+FB5=10,FA5<10)),FC5=0),\"G\",IF(AND(FA5=10,FB5<10,FC5=0),\"-\",IF(FA5+FB5<10,\"\",FC5)))))))))))","v":"X"},null,null,null,null,"(",null,{"$f":"EH9-EH10","v":0},null,null,null,",",null,{"$f":"IF(FB6=0,(DG5+DS5)-EH11,(DG5+DS5+1)-EH11)","v":0},null,null,null,")",null,{"$f":"COUNTIF(EI6:FA6,\">0\")","v":0},null,null,null,null,null,null,null,null,null,null,null,null,"2F","C",null,{"$f":"COUNTIF(D7:M12,\"・\")","v":10},{"$f":"COUNTIF(D7:M12,\"○\")","v":0},{"$f":"COUNTIF(N7:W12,\"・\")","v":10},{"$f":"COUNTIF(N7:W12,\"○\")","v":0},{"$f":"COUNTIF(X7:AG12,\"・\")","v":10},{"$f":"COUNTIF(X7:AG12,\"○\")","v":0},{"$f":"COUNTIF(AH7:AQ12,\"・\")","v":10},{"$f":"COUNTIF(AH7:AQ12,\"○\")","v":0},{"$f":"COUNTIF(AR7:BA12,\"・\")","v":10},{"$f":"COUNTIF(AR7:BA12,\"○\")","v":0},{"$f":"COUNTIF(BB7:BK12,\"・\")","v":10},{"$f":"COUNTIF(BB7:BK12,\"○\")","v":0},{"$f":"COUNTIF(BL7:BU12,\"・\")","v":10},{"$f":"COUNTIF(BL7:BU12,\"○\")","v":0},{"$f":"COUNTIF(BV7:CE12,\"・\")","v":10},{"$f":"COUNTIF(BV7:CE12,\"○\")","v":0},{"$f":"COUNTIF(CF7:CO12,\"・\")","v":10},{"$f":"COUNTIF(CF7:CO12,\"○\")","v":0},{"$f":"COUNTIF(CP7:CY12,\"・\")","v":10},{"$f":"IF(FA5=10,COUNTIF(CZ7:DI12,\"・\"),COUNTIF(CP7:CY12,\"○\"))","v":10},{"$f":"IF(AND(FA5=10,FB5=10),COUNTIF(DJ7:DS12,\"・\"),IF(AND(FA5=10,FB5<10),COUNTIF(CZ7:DI12,\"○\"),IF(AND(FA5<10,FA5+FB5=10),COUNTIF(CZ7:DI12,\"・\"),\"0\")))","v":10}]
[null,null,null,{"$f":"IF(AND(EI5=10,EK5=10),20+EM5,IF(AND(EI5=10,EK5<10),10+EK5+EL5,IF(AND(EI5<10,EI5+EJ5=10),10+EK5,EI5+EJ5)))","v":30},null,null,null,null,null,null,null,null,null,{"$f":"IF(AND(EK5=10,EM5=10),D6+20+EO5,IF(AND(EK5=10,EM5<10),D6+10+EM5+EN5,IF(AND(EK5<10,EK5+EL5=10),D6+10+EM5,D6+EK5+EL5)))","v":60},null,null,null,null,null,null,null,null,null,{"$f":"IF(AND(EM5=10,EO5=10),N6+20+EQ5,IF(AND(EM5=10,EO5<10),N6+10+EO5+EP5,IF(AND(EM5<10,EM5+EN5=10),N6+10+EO5,N6+EM5+EN5)))","v":90},null,null,null,null,null,null,null,null,null,{"$f":"IF(AND(EO5=10,EQ5=10),X6+20+ES5,IF(AND(EO5=10,EQ5<10),X6+10+EQ5+ER5,IF(AND(EO5<10,EO5+EP5=10),X6+10+EQ5,X6+EO5+EP5)))","v":120},null,null,null,null,null,null,null,null,null,{"$f":"IF(AND(EQ5=10,ES5=10),AH6+20+EU5,IF(AND(EQ5=10,ES5<10),AH6+10+ES5+ET5,IF(AND(EQ5<10,EQ5+ER5=10),AH6+10+ES5,AH6+EQ5+ER5)))","v":150},null,null,null,null,null,null,null,null,null,{"$f":"IF(AND(ES5=10,EU5=10),AR6+20+EW5,IF(AND(ES5=10,EU5<10),AR6+10+EU5+EV5,IF(AND(ES5<10,ES5+ET5=10),AR6+10+EU5,AR6+ES5+ET5)))","v":180},null,null,null,null,null,null,null,null,null,{"$f":"IF(AND(EU5=10,EW5=10),BB6+20+EY5,IF(AND(EU5=10,EW5<10),BB6+10+EW5+EX5,IF(AND(EU5<10,EU5+EV5=10),BB6+10+EW5,BB6+EU5+EV5)))","v":210},null,null,null,null,null,null,null,null,null,{"$f":"IF(AND(EW5=10,EY5=10),BL6+20+FA5,IF(AND(EW5=10,EY5<10),BL6+10+EY5+EZ5,IF(AND(EW5<10,EW5+EX5=10),BL6+10+EY5,BL6+EW5+EX5)))","v":240},null,null,null,null,null,null,null,null,null,{"$f":"IF(AND(EY5=10,FA5=10),BV6+20+FB5,IF(AND(EY5=10,FA5<10),BV6+10+FA5+FB5,IF(AND(EY5<10,EY5+EZ5=10),BV6+10+FA5,BV6+EY5+EZ5)))","v":270},null,null,null,null,null,null,null,null,null,{"$f":"CF6+FA5+FB5+FC5","v":300},null,null,null,null,null,null,null,null,null,null,null,null,null,null,"〈",null,{"$f":"COUNTIF(D12:DS12,\"P\")+COUNTIF(D12:DS12,\"S\")+COUNTIF(D12:DS12,\"C\")","v":0},null,null,null,",",null,{"$f":"COUNTIF(D12:DS12,\"P\")","v":0},null,null,null,",",null,{"$f":"COUNTIF(EI8:FA8,\"1\")","v":10},null,null,null,"〉",null,{"$f":"COUNTIF(D12:DS12,\"H\")","v":0},null,null,null,null,null,null,"1,2F","H",null,{"$f":"COUNTIF(D7:M12,\"●\")","v":0},null,{"$f":"COUNTIF(N7:W12,\"●\")","v":0},null,{"$f":"COUNTIF(X7:AG12,\"●\")","v":0},null,{"$f":"COUNTIF(AH7:AQ12,\"●\")","v":0},null,{"$f":"COUNTIF(AR7:BA12,\"●\")","v":0},null,{"$f":"COUNTIF(BB7:BK12,\"●\")","v":0},null,{"$f":"COUNTIF(BL7:BU12,\"●\")","v":0},null,{"$f":"COUNTIF(BV7:CE12,\"●\")","v":0},null,{"$f":"COUNTIF(CF7:CO12,\"●\")","v":0},null,{"$f":"COUNTIF(CP7:CY12,\"●\")","v":0},{"$f":"COUNTIF(CZ7:DI12,\"●\")","v":0},{"$f":"COUNTIF(DJ7:DS12,\"●\")","v":0}]
[]
[null,null,null,null,"・",null,"・",null,"・",null,"・",null,null,null,"・",null,"・",null,"・",null,"・",null,null,null,"・",null,"・",null,"・",null,"・",null,null,null,"・",null,"・",null,"・",null,"・",null,null,null,"・",null,"・",null,"・",null,"・",null,null,null,"・",null,"・",null,"・",null,"・",null,null,null,"・",null,"・",null,"・",null,"・",null,null,null,"・",null,"・",null,"・",null,"・",null,null,null,"・",null,"・",null,"・",null,"・",null,null,null,"・",null,"・",null,"・",null,"・",null,null,null,"・",null,"・",null,"・",null,"・",null,null,null,"・",null,"・",null,"・",null,"・",null,null,null,null,null,null,null,null,null,null,null,null,null,null,null,null,null,{"$f":"IF(AND(EI5=10,EK5=10),\"1\",\"0\")","v":"1"},null,{"$f":"IF(AND(EK5=10,EM5=10),\"1\",\"0\")","v":"1"},null,{"$f":"IF(AND(EM5=10,EO5=10),\"1\",\"0\")","v":"1"},null,{"$f":"IF(AND(EO5=10,EQ5=10),\"1\",\"0\")","v":"1"},null,{"$f":"IF(AND(EQ5=10,ES5=10),\"1\",\"0\")","v":"1"},null,{"$f":"IF(AND(ES5=10,EU5=10),\"1\",\"0\")","v":"1"},null,"1",null,{"$f":"IF(AND(EW5=10,EY5=10),\"1\",\"0\")","v":"1"},null,{"$f":"IF(AND(EY5=10,FA5=10),\"1\",\"0\")","v":"1"},null,{"$f":"IF(AND(FA5=10,FB5=10),\"1\",\"0\")","v":"1"}]
[null,null,null,null,null,"・",null,"・",null,"・",null,null,null,null,null,"・",null,"・",null,"・",null,null,null,null,null,"・",null,"・",null,"・",null,null,null,null,null,"・",null,"・",null,"・",null,null,null,null,null,"・",null,"・",null,"・",null,null,null,null,null,"・",null,"・",null,"・",null,null,null,null,null,"・",null,"・",null,"・",null,null,null,null,null,"・",null,"・",null,"・",null,null,null,null,null,"・",null,"・",null,"・",null,null,null,null,null,"・",null,"・",null,"・",null,null,null,null,null,"・",null,"・",null,"・",null,null,null,null,null,"・",null,"・",null,"・",null,null,null,null,null,null,null,null,null,null,null,null,null,null,null,null,null,{"$f":"COUNTIF(D5:DD5,\"/\")","v":0}]
[null,null,null,null,null,null,"・",null,"・",null,null,null,null,null,null,null,"・",null,"・",null,null,null,null,null,null,null,"・",null,"・",null,null,null,null,null,null,null,"・",null,"・",null,null,null,null,null,null,null,"・",null,"・",null,null,null,null,null,null,null,"・",null,"・",null,null,null,null,null,null,null,"・",null,"・",null,null,null,null,null,null,null,"・",null,"・",null,null,null,null,null,null,null,"・",null,"・",null,null,null,null,null,null,null,"・",null,"・",null,null,null,null,null,null,null,"・",null,"・",null,null,null,null,null,null,null,"・",null,"・",null,null,null,null,null,null,null,null,null,null,null,null,null,null,null,null,null,null,{"$f":"COUNTIF(EI10:FA10,\"1\")","v":0},{"$f":"IF(AND(E12=\"1○\",I5=\"/\"),\"1\",\"0\")","v":"0"},null,{"$f":"IF(AND(O12=\"1○\",S5=\"/\"),\"1\",\"0\")","v":"0"},null,{"$f":"IF(AND(Y12=\"1○\",AC5=\"/\"),\"1\",\"0\")","v":"0"},null,{"$f":"IF(AND(AI12=\"1○\",AM5=\"/\"),\"1\",\"0\")","v":"0"},null,{"$f":"IF(AND(AS12=\"1○\",AW5=\"/\"),\"1\",\"0\")","v":"0"},null,{"$f":"IF(AND(BC12=\"1○\",BG5=\"/\"),\"1\",\"0\")","v":"0"},null,{"$f":"IF(AND(BM12=\"1○\",BQ5=\"/\"),\"1\",\"0\")","v":"0"},null,{"$f":"IF(AND(BW12=\"1○\",CA5=\"/\"),\"1\",\"0\")","v":"0"},null,{"$f":"IF(AND(CG12=\"1○\",CK5=\"/\"),\"1\",\"0\")","v":"0"},null,{"$f":"IF(OR(AND(CQ12=\"1○\",CU5=\"/\"),AND(DA12=\"1○\",CZ5=\"/\")),\"1\",\"0\")","v":"0"}]
[null,null,null,null,null,null,null,"・",null,null,null,null,null,null,null,null,null,"・",null,null,null,null,null,null,null,null,null,"・",null,null,null,null,null,null,null,null,null,"・",null,null,null,null,null,null,null,null,null,"・",null,null,null,null,null,null,null,null,null,"・",null,null,null,null,null,null,null,null,null,"・",null,null,null,null,null,null,null,null,null,"・",null,null,null,null,null,null,null,null,null,"・",null,null,null,null,null,null,null,null,null,"・",null,null,null,null,null,null,null,null,null,"・",null,null,null,null,null,null,null,null,null,"・",null,null,null,null,null,null,null,null,null,null,null,null,null,null,null,null,null,null,null,{"$f":"COUNTIF(EI11:FA11,\"1\")","v":0},{"$f":"IF(AND(E12=\"1○\",EI5+EJ5<10),\"1\",\"0\")","v":"0"},null,{"$f":"IF(AND(O12=\"1○\",EK5+EL5<10),\"1\",\"0\")","v":"0"},null,{"$f":"IF(AND(Y12=\"1○\",EM5+EN5<10),\"1\",\"0\")","v":"0"},null,{"$f":"IF(AND(AI12=\"1○\",EO5+EP5<10),\"1\",\"0\")","v":"0"},null,{"$f":"IF(AND(AS12=\"1○\",EQ5+ER5<10),\"1\",\"0\")","v":"0"},null,{"$f":"IF(AND(BC12=\"1○\",ES5+ET5<10),\"1\",\"0\")","v":"0"},null,{"$f":"IF(AND(BM12=\"1○\",EU5+EV5<10),\"1\",\"0\")","v":"0"},null,{"$f":"IF(AND(BW12=\"1○\",EW5+EX5<10),\"1\",\"0\")","v":"0"},null,{"$f":"IF(AND(CG12=\"1○\",EY5+EZ5<10),\"1\",\"0\")","v":"0"},null,{"$f":"IF(OR(AND(CQ12=\"1○\",FA5+FB5<10),AND(DA12=\"1○\",FB5+FC5<10)),\"1\",\"0\")","v":"0"}]
[]
[]
[null,null,"Player 2",1,null,null,null,null,null,null,null,null,null,2,null,null,null,null,null,null,null,null,null,3,null,null,null,null,null,null,null,null,null,4,null,null,null,null,null,null,null,null,null,5,null,null,null,null,null,null,null,null,null,6,null,null,null,null,null,null,null,null,null,7,null,null,null,null,null,null,null,null,null,8,null,null,null,null,null,null,null,null,null,9,null,null,null,null,null,null,null,null,null,10,null,null,null,null,null,null,null,null,null,null,null,null,null,null,null,null,null,null,null,null,null,null,null,null,null,null,null,null,null,null,null,null,null,null,null,null,null,null,null,null,null,null,null,null,1,null,2,null,3,null,4,null,5,null,6,null,7,null,8,null,9,null,10]
[null,null,null,{"$f":"IF(EI15=10,\"X\",IF(AND(EI15=0,OR(E22=\"1F\",E22=\"1,2F\")),\"F\",IF(EI15=0,\"G\",IF(AND(EI15=8,E22=\"1○\"),\"⑧\",IF(AND(EI15=7,E22=\"1○\"),\"⑦\",IF(AND(EI15=6,E22=\"1○\"),\"⑥\",IF(AND(EI15=5,E22=\"1○\"),\"⑤\",IF(AND(EI15=4,E22=\"1○\"),\"④\",EI15))))))))","v":"X"},null,null,null,null,{"$f":"IF(AND(EI15<10,EI15+EJ15=10),\"/\",IF(EI15=10,\"\",IF(OR(AND(EJ15=0,E22=\"2F\"),AND(EJ15=0,E22=\"1,2F\")),\"F\",IF(EJ15=0,\"-\",EJ15))))","v":""},null,null,null,null,{"$f":"IF(EK15=10,\"X\",IF(AND(EK15=0,OR(O22=\"1F\",O22=\"1,2F\")),\"F\",IF(EK15=0,\"G\",IF(AND(EK15=8,O22=\"1○\"),\"⑧\",IF(AND(EK15=7,O22=\"1○\"),\"⑦\",IF(AND(EK15=6,O22=\"1○\"),\"⑥\",IF(AND(EK15=5,O22=\"1○\"),\"⑤\",IF(AND(EK15=4,O22=\"1○\"),\"④\",EK15))))))))","v":"X"},null,null,null,null,{"$f":"IF(AND(EK15<10,EK15+EL15=10),\"/\",IF(EK15=10,\"\",IF(OR(AND(EL15=0,O22=\"2F\"),AND(EL15=0,O22=\"1,2F\")),\"F\",IF(EL15=0,\"-\",EL15))))","v":""},null,null,null,null,{"$f":"IF(EM15=10,\"X\",IF(AND(EM15=0,OR(Y22=\"1F\",Y22=\"1,2F\")),\"F\",IF(EM15=0,\"G\",IF(AND(EM15=8,Y22=\"1○\"),\"⑧\",IF(AND(EM15=7,Y22=\"1○\"),\"⑦\",IF(AND(EM15=6,Y22=\"1○\"),\"⑥\",IF(AND(EM15=5,Y22=\"1○\"),\"⑤\",IF(AND(EM15=4,Y22=\"1○\"),\"④\",EM15))))))))","v":"X"},null,null,null,null,{"$f":"IF(AND(EM15<10,EM15+EN15=10),\"/\",IF(EM15=10,\"\",IF(OR(AND(EN15=0,Y22=\"2F\"),AND(EN15=0,Y22=\"1,2F\")),\"F\",IF(EN15=0,\"-\",EN15))))","v":""},null,null,null,null,{"$f":"IF(EO15=10,\"X\",IF(AND(EO15=0,OR(AI22=\"1F\",AI22=\"1,2F\")),\"F\",IF(EO15=0,\"G\",IF(AND(EO15=8,AI22=\"1○\"),\"⑧\",IF(AND(EO15=7,AI22=\"1○\"),\"⑦\",IF(AND(EO15=6,AI22=\"1○\"),\"⑥\",IF(AND(EO15=5,AI22=\"1○\"),\"⑤\",IF(AND(EO15=4,AI22=\"1○\"),\"④\",EO15))))))))","v":"X"},null,null,null,null,{"$f":"IF(AND(EO15<10,EO15+EP15=10),\"/\",IF(EO15=10,\"\",IF(OR(AND(EP15=0,AI22=\"2F\"),AND(EP15=0,AI22=\"1,2F\")),\"F\",IF(EP15=0,\"-\",EP15))))","v":""},null,null,null,null,{"$f":"IF(EQ15=10,\"X\",IF(AND(EQ15=0,OR(AS22=\"1F\",AS22=\"1,2F\")),\"F\",IF(EQ15=0,\"G\",IF(AND(EQ15=8,AS22=\"1○\"),\"⑧\",IF(AND(EQ15=7,AS22=\"1○\"),\"⑦\",IF(AND(EQ15=6,AS22=\"1○\"),\"⑥\",IF(AND(EQ15=5,AS22=\"1○\"),\"⑤\",IF(AND(EQ15=4,AS22=\"1○\"),\"④\",EQ15))))))))","v":"X"},null,null,null,null,{"$f":"IF(AND(EQ15<10,EQ15+ER15=10),\"/\",IF(EQ15=10,\"\",IF(OR(AND(ER15=0,AS22=\"2F\"),AND(ER15=0,AS22=\"1,2F\")),\"F\",IF(ER15=0,\"-\",ER15))))","v":""},null,null,null,null,{"$f":"IF(ES15=10,\"X\",IF(AND(ES15=0,OR(BC22=\"1F\",BC22=\"1,2F\")),\"F\",IF(ES15=0,\"G\",IF(AND(ES15=8,BC22=\"1○\"),\"⑧\",IF(AND(ES15=7,BC22=\"1○\"),\"⑦\",IF(AND(ES15=6,BC22=\"1○\"),\"⑥\",IF(AND(ES15=5,BC22=\"1○\"),\"⑤\",IF(AND(ES15=4,BC22=\"1○\"),\"④\",ES15))))))))","v":"X"},null,null,null,null,{"$f":"IF(AND(ES15<10,ES15+ET15=10),\"/\",IF(ES15=10,\"\",IF(OR(AND(ET15=0,BC22=\"2F\"),AND(ET15=0,BC22=\"1,2F\")),\"F\",IF(ET15=0,\"-\",ET15))))","v":""},null,null,null,null,{"$f":"IF(EU15=10,\"X\",IF(AND(EU15=0,OR(BM22=\"1F\",BM22=\"1,2F\")),\"F\",IF(EU15=0,\"G\",IF(AND(EU15=8,BM22=\"1○\"),\"⑧\",IF(AND(EU15=7,BM22=\"1○\"),\"⑦\",IF(AND(EU15=6,BM22=\"1○\"),\"⑥\",IF(AND(EU15=5,BM22=\"1○\"),\"⑤\",IF(AND(EU15=4,BM22=\"1○\"),\"④\",EU15))))))))","v":"X"},null,null,null,null,{"$f":"IF(AND(EU15<10,EU15+EV15=10),\"/\",IF(EU15=10,\"\",IF(OR(AND(EV15=0,BM22=\"2F\"),AND(EV15=0,BM22=\"1,2F\")),\"F\",IF(EV15=0,\"-\",EV15))))","v":""},null,null,null,null,{"$f":"IF(EW15=10,\"X\",IF(AND(EW15=0,OR(BW22=\"1F\",BW22=\"1,2F\")),\"F\",IF(EW15=0,\"G\",IF(AND(EW15=8,BW22=\"1○\"),\"⑧\",IF(AND(EW15=7,BW22=\"1○\"),\"⑦\",IF(AND(EW15=6,BW22=\"1○\"),\"⑥\",IF(AND(EW15=5,BW22=\"1○\"),\"⑤\",IF(AND(EW15=4,BW22=\"1○\"),\"④\",EW15))))))))","v":"X"},null,null,null,null,{"$f":"IF(AND(EW15<10,EW15+EX15=10),\"/\",IF(EW15=10,\"\",IF(OR(AND(EX15=0,BW22=\"2F\"),AND(EX15=0,BW22=\"1,2F\")),\"F\",IF(EX15=0,\"-\",EX15))))","v":""},null,null,null,null,{"$f":"IF(EY15=10,\"X\",IF(AND(EY15=0,OR(CG22=\"1F\",CG22=\"1,2F\")),\"F\",IF(EY15=0,\"G\",IF(AND(EY15=8,CG22=\"1○\"),\"⑧\",IF(AND(EY15=7,CG22=\"1○\"),\"⑦\",IF(AND(EY15=6,CG22=\"1○\"),\"⑥\",IF(AND(EY15=5,CG22=\"1○\"),\"⑤\",IF(AND(EY15=4,CG22=\"1○\"),\"④\",EY15))))))))","v":"X"},null,null,null,null,{"$f":"IF(AND(EY15<10,EY15+EZ15=10),\"/\",IF(EY15=10,\"\",IF(OR(AND(EZ15=0,CG22=\"2F\"),AND(EZ15=0,CG22=\"1,2F\")),\"F\",IF(EZ15=0,\"-\",EZ15))))","v":""},null,null,null,null,{"$f":"IF(FA15=10,\"X\",IF(AND(FA15=0,OR(CQ22=\"1F\",CQ22=\"1,2F\")),\"F\",IF(FA15=0,\"G\",IF(AND(FA15=8,CQ22=\"1○\"),\"⑧\",IF(AND(FA15=7,CQ22=\"1○\"),\"⑦\",IF(AND(FA15=6,CQ22=\"1○\"),\"⑥\",IF(AND(FA15=5,CQ22=\"1○\"),\"⑤\",IF(AND(FA15=4,CQ22=\"1○\"),\"④\",FA15))))))))","v":"X"},null,null,null,null,{"$f":"IF(AND(FA15=10,FB15=10),\"X\",IF(AND(FA15<10,FA15+FB15=10),\"/\",IF(OR(AND(FA15=10,FB15=0,DA22=\"1F\"),AND(FA15=10,FB15=0,DA22=\"1,2F\")),\"F\",IF(AND(FA15=10,FB15=0),\"G\",IF(AND(FA15=10,FB15=8,DA22=\"1○\"),\"⑧\",IF(AND(FA15=10,FB15=7,DA22=\"1○\"),\"⑦\",IF(AND(FA15=10,FB15=6,DA22=\"1○\"),\"⑥\",IF(AND(FA15=10,FB15=5,DA22=\"1○\"),\"⑤\",IF(AND(FA15=10,FB15=4,DA22=\"1○\"),\"④\",IF(AND(FA15=10,FB15<10),FB15,IF(OR(AND(FA15<10,FB15=0,CQ22=\"2F\"),AND(FA15<10,FB15=0,CQ22=\"1,2F\")),\"F\",IF(AND(FA15<10,FB15=0),\"-\",FB15))))))))))))","v":"X"},null,null,null,null,{"$f":"IF(FC15=10,\"X\",IF(OR(AND(FB15=10,FC15=8,DK22=\"1○\"),AND(FA15+FB15=10,FC15=8,DA22=\"1○\")),\"⑧\",IF(OR(AND(FB15=10,FC15=7,DK22=\"1○\"),AND(FA15+FB15=10,FC15=7,DA22=\"1○\")),\"⑦\",IF(OR(AND(FB15=10,FC15=6,DK22=\"1○\"),AND(FA15+FB15=10,FC15=6,DA22=\"1○\")),\"⑥\",IF(OR(AND(FB15=10,FC15=5,DK22=\"1○\"),AND(FA15+FB15=10,FC15=5,DA22=\"1○\")),\"⑤\",IF(OR(AND(FB15=10,FC15=4,DK22=\"1○\"),AND(FA15+FB15=10,FC15=4,DA22=\"1○\")),\"④\",IF(OR(AND(FB15=10,FC15=0,DK22=\"1F\"),AND(FB15<10,FC15=0,DA22=\"2F\"),AND(FB15<10,FC15=0,DA22=\"1,2F\")),\"F\",IF(AND(FA15=10,FB15<10,FB15+FC15=10),\"/\",IF(AND(OR(FB15=10,AND(FA15+FB15=10,FA15<10)),FC15=0),\"G\",IF(AND(FA15=10,FB15<10,FC15=0),\"-\",IF(FA15+FB15<10,\"\",FC15)))))))))))","v":"X"},null,null,null,null,"(",null,{"$f":"EH19-EH20","v":0},null,null,null,",",null,{"$f":"IF(FB16=0,(DG15+DS15)-EH21,(DG15+DS15+1)-EH21)","v":0},null,null,null,")",null,{"$f":"COUNTIF(EI16:FA16,\">0\")","v":0},null,null,null,null,null,null,null,null,null,null,null,null,null,null,null,{"$f":"COUNTIF(D17:M22,\"・\")","v":10},{"$f":"COUNTIF(D17:M22,\"○\")","v":0},{"$f":"COUNTIF(N17:W22,\"・\")","v":10},{"$f":"COUNTIF(N17:W22,\"○\")","v":0},{"$f":"COUNTIF(X17:AG22,\"・\")","v":10},{"$f":"COUNTIF(X17:AG22,\"○\")","v":0},{"$f":"COUNTIF(AH17:AQ22,\"・\")","v":10},{"$f":"COUNTIF(AH17:AQ22,\"○\")","v":0},{"$f":"COUNTIF(AR17:BA22,\"・\")","v":10},{"$f":"COUNTIF(AR17:BA22,\"○\")","v":0},{"$f":"COUNTIF(BB17:BK22,\"・\")","v":10},{"$f":"COUNTIF(BB17:BK22,\"○\")","v":0},{"$f":"COUNTIF(BL17:BU22,\"・\")","v":10},{"$f":"COUNTIF(BL17:BU22,\"○\")","v":0},{"$f":"COUNTIF(BV17:CE22,\"・\")","v":10},{"$f":"COUNTIF(BV17:CE22,\"○\")","v":0},{"$f":"COUNTIF(CF17:CO22,\"・\")","v":10},{"$f":"COUNTIF(CF17:CO22,\"○\")","v":0},{"$f":"COUNTIF(CP17:CY22,\"・\")","v":10},{"$f":"IF(FA15=10,COUNTIF(CZ17:DI22,\"・\"),COUNTIF(CP17:CY22,\"○\"))","v":10},{"$f":"IF(AND(FA15=10,FB15=10),COUNTIF(DJ17:DS22,\"・\"),IF(AND(FA15=10,FB15<10),COUNTIF(CZ17:DI22,\"○\"),IF(AND(FA15<10,FA15+FB15=10),COUNTIF(CZ17:DI22,\"・\"),\"0\")))","v":10}]
[null,null,null,{"$f":"IF(AND(EI15=10,EK15=10),20+EM15,IF(AND(EI15=10,EK15<10),10+EK15+EL15,IF(AND(EI15<10,EI15+EJ15=10),10+EK15,EI15+EJ15)))","v":30},null,null,null,null,null,null,null,null,null,{"$f":"IF(AND(EK15=10,EM15=10),D16+20+EO15,IF(AND(EK15=10,EM15<10),D16+10+EM15+EN15,IF(AND(EK15<10,EK15+EL15=10),D16+10+EM15,D16+EK15+EL15)))","v":60},null,null,null,null,null,null,null,null,null,{"$f":"IF(AND(EM15=10,EO15=10),N16+20+EQ15,IF(AND(EM15=10,EO15<10),N16+10+EO15+EP15,IF(AND(EM15<10,EM15+EN15=10),N16+10+EO15,N16+EM15+EN15)))","v":90},null,null,null,null,null,null,null,null,null,{"$f":"IF(AND(EO15=10,EQ15=10),X16+20+ES15,IF(AND(EO15=10,EQ15<10),X16+10+EQ15+ER15,IF(AND(EO15<10,EO15+EP15=10),X16+10+EQ15,X16+EO15+EP15)))","v":120},null,null,null,null,null,null,null,null,null,{"$f":"IF(AND(EQ15=10,ES15=10),AH16+20+EU15,IF(AND(EQ15=10,ES15<10),AH16+10+ES15+ET15,IF(AND(EQ15<10,EQ15+ER15=10),AH16+10+ES15,AH16+EQ15+ER15)))","v":150},null,null,null,null,null,null,null,null,null,{"$f":"IF(AND(ES15=10,EU15=10),AR16+20+EW15,IF(AND(ES15=10,EU15<10),AR16+10+EU15+EV15,IF(AND(ES15<10,ES15+ET15=10),AR16+10+EU15,AR16+ES15+ET15)))","v":180},null,null,null,null,null,null,null,null,null,{"$f":"IF(AND(EU15=10,EW15=10),BB16+20+EY15,IF(AND(EU15=10,EW15<10),BB16+10+EW15+EX15,IF(AND(EU15<10,EU15+EV15=10),BB16+10+EW15,BB16+EU15+EV15)))","v":210},null,null,null,null,null,null,null,null,null,{"$f":"IF(AND(EW15=10,EY15=10),BL16+20+FA15,IF(AND(EW15=10,EY15<10),BL16+10+EY15+EZ15,IF(AND(EW15<10,EW15+EX15=10),BL16+10+EY15,BL16+EW15+EX15)))","v":240},null,null,null,null,null,null,null,null,null,{"$f":"IF(AND(EY15=10,FA15=10),BV16+20+FB15,IF(AND(EY15=10,FA15<10),BV16+10+FA15+FB15,IF(AND(EY15<10,EY15+EZ15=10),BV16+10+FA15,BV16+EY15+EZ15)))","v":270},null,null,null,null,null,null,null,null,null,{"$f":"CF16+FA15+FB15+FC15","v":300},null,null,null,null,null,null,null,null,null,null,null,null,null,null,"〈",null,{"$f":"COUNTIF(D22:DS22,\"P\")+COUNTIF(D22:DS22,\"S\")+COUNTIF(D22:DS22,\"C\")","v":0},null,null,null,",",null,{"$f":"COUNTIF(D22:DS22,\"P\")","v":0},null,null,null,",",null,{"$f":"COUNTIF(EI18:FA18,\"1\")","v":10},null,null,null,"〉",null,{"$f":"COUNTIF(D22:DS22,\"H\")","v":0},null,null,null,null,null,null,null,null,null,{"$f":"COUNTIF(D17:M22,\"●\")","v":0},null,{"$f":"COUNTIF(N17:W22,\"●\")","v":0},null,{"$f":"COUNTIF(X17:AG22,\"●\")","v":0},null,{"$f":"COUNTIF(AH17:AQ22,\"●\")","v":0},null,{"$f":"COUNTIF(AR17:BA22,\"●\")","v":0},null,{"$f":"COUNTIF(BB17:BK22,\"●\")","v":0},null,{"$f":"COUNTIF(BL17:BU22,\"●\")","v":0},null,{"$f":"COUNTIF(BV17:CE22,\"●\")","v":0},null,{"$f":"COUNTIF(CF17:CO22,\"●\")","v":0},null,{"$f":"COUNTIF(CP17:CY22,\"●\")","v":0},{"$f":"COUNTIF(CZ17:DI22,\"●\")","v":0},{"$f":"COUNTIF(DJ17:DS22,\"●\")","v":0}]
[]
[null,null,null,null,"・",null,"・",null,"・",null,"・",null,null,null,"・",null,"・",null,"・",null,"・",null,null,null,"・",null,"・",null,"・",null,"・",null,null,null,"・",null,"・",null,"・",null,"・",null,null,null,"・",null,"・",null,"・",null,"・",null,null,null,"・",null,"・",null,"・",null,"・",null,null,null,"・",null,"・",null,"・",null,"・",null,null,null,"・",null,"・",null,"・",null,"・",null,null,null,"・",null,"・",null,"・",null,"・",null,null,null,"・",null,"・",null,"・",null,"・",null,null,null,"・",null,"・",null,"・",null,"・",null,null,null,"・",null,"・",null,"・",null,"・",null,null,null,null,null,null,null,null,null,null,null,null,null,null,null,null,null,{"$f":"IF(AND(EI15=10,EK15=10),\"1\",\"0\")","v":"1"},null,{"$f":"IF(AND(EK15=10,EM15=10),\"1\",\"0\")","v":"1"},null,"1",null,"1",null,"1",null,"1",null,"1",null,"1",null,{"$f":"IF(AND(EY15=10,FA15=10),\"1\",\"0\")","v":"1"},null,{"$f":"IF(AND(FA15=10,FB15=10),\"1\",\"0\")","v":"1"}]
[null,null,null,null,null,"・",null,"・",null,"・",null,null,null,null,null,"・",null,"・",null,"・",null,null,null,null,null,"・",null,"・",null,"・",null,null,null,null,null,"・",null,"・",null,"・",null,null,null,null,null,"・",null,"・",null,"・",null,null,null,null,null,"・",null,"・",null,"・",null,null,null,null,null,"・",null,"・",null,"・",null,null,null,null,null,"・",null,"・",null,"・",null,null,null,null,null,"・",null,"・",null,"・",null,null,null,null,null,"・",null,"・",null,"・",null,null,null,null,null,"・",null,"・",null,"・",null,null,null,null,null,"・",null,"・",null,"・",null,null,null,null,null,null,null,null,null,null,null,null,null,null,null,null,null,{"$f":"COUNTIF(D15:DD15,\"/\")","v":0}]
[null,null,null,null,null,null,"・",null,"・",null,null,null,null,null,null,null,"・",null,"・",null,null,null,null,null,null,null,"・",null,"・",null,null,null,null,null,null,null,"・",null,"・",null,null,null,null,null,null,null,"・",null,"・",null,null,null,null,null,null,null,"・",null,"・",null,null,null,null,null,null,null,"・",null,"・",null,null,null,null,null,null,null,"・",null,"・",null,null,null,null,null,null,null,"・",null,"・",null,null,null,null,null,null,null,"・",null,"・",null,null,null,null,null,null,null,"・",null,"・",null,null,null,null,null,null,null,"・",null,"・",null,null,null,null,null,null,null,null,null,null,null,null,null,null,null,null,null,null,{"$f":"COUNTIF(EI20:FA20,\"1\")","v":0},{"$f":"IF(AND(E22=\"1○\",I15=\"/\"),\"1\",\"0\")","v":"0"},null,{"$f":"IF(AND(O22=\"1○\",S15=\"/\"),\"1\",\"0\")","v":"0"},null,{"$f":"IF(AND(Y22=\"1○\",AC15=\"/\"),\"1\",\"0\")","v":"0"},null,{"$f":"IF(AND(AI22=\"1○\",AM15=\"/\"),\"1\",\"0\")","v":"0"},null,{"$f":"IF(AND(AS22=\"1○\",AW15=\"/\"),\"1\",\"0\")","v":"0"},null,{"$f":"IF(AND(BC22=\"1○\",BG15=\"/\"),\"1\",\"0\")","v":"0"},null,{"$f":"IF(AND(BM22=\"1○\",BQ15=\"/\"),\"1\",\"0\")","v":"0"},null,{"$f":"IF(AND(BW22=\"1○\",CA15=\"/\"),\"1\",\"0\")","v":"0"},null,{"$f":"IF(AND(CG22=\"1○\",CK15=\"/\"),\"1\",\"0\")","v":"0"},null,{"$f":"IF(OR(AND(CQ22=\"1○\",CU15=\"/\"),AND(DA22=\"1○\",CZ15=\"/\")),\"1\",\"0\")","v":"0"}]
[null,null,null,null,null,null,null,"・",null,null,null,null,null,null,null,null,null,"・",null,null,null,null,null,null,null,null,null,"・",null,null,null,null,null,null,null,null,null,"・",null,null,null,null,null,null,null,null,null,"・",null,null,null,null,null,null,null,null,null,"・",null,null,null,null,null,null,null,null,null,"・",null,null,null,null,null,null,null,null,null,"・",null,null,null,null,null,null,null,null,null,"・",null,null,null,null,null,null,null,null,null,"・",null,null,null,null,null,null,null,null,null,"・",null,null,null,null,null,null,null,null,null,"・",null,null,null,null,null,null,null,null,null,null,null,null,null,null,null,null,null,null,null,{"$f":"COUNTIF(EI21:FA21,\"1\")","v":0},{"$f":"IF(AND(E22=\"1○\",EI15+EJ15<10),\"1\",\"0\")","v":"0"},null,{"$f":"IF(AND(O22=\"1○\",EK15+EL15<10),\"1\",\"0\")","v":"0"},null,{"$f":"IF(AND(Y22=\"1○\",EM15+EN15<10),\"1\",\"0\")","v":"0"},null,{"$f":"IF(AND(AI22=\"1○\",EO15+EP15<10),\"1\",\"0\")","v":"0"},null,{"$f":"IF(AND(AS22=\"1○\",EQ15+ER15<10),\"1\",\"0\")","v":"0"},null,{"$f":"IF(AND(BC22=\"1○\",ES15+ET15<10),\"1\",\"0\")","v":"0"},null,{"$f":"IF(AND(BM22=\"1○\",EU15+EV15<10),\"1\",\"0\")","v":"0"},null,{"$f":"IF(AND(BW22=\"1○\",EW15+EX15<10),\"1\",\"0\")","v":"0"},null,{"$f":"IF(AND(CG22=\"1○\",EY15+EZ15<10),\"1\",\"0\")","v":"0"},null,{"$f":"IF(OR(AND(CQ22=\"1○\",FA15+FB15<10),AND(DA22=\"1○\",FB15+FC15<10)),\"1\",\"0\")","v":"0"}]
[]
[]
[null,null,"Player 3",1,null,null,null,null,null,null,null,null,null,2,null,null,null,null,null,null,null,null,null,3,null,null,null,null,null,null,null,null,null,4,null,null,null,null,null,null,null,null,null,5,null,null,null,null,null,null,null,null,null,6,null,null,null,null,null,null,null,null,null,7,null,null,null,null,null,null,null,null,null,8,null,null,null,null,null,null,null,null,null,9,null,null,null,null,null,null,null,null,null,10,null,null,null,null,null,null,null,null,null,null,null,null,null,null,null,null,null,null,null,null,null,null,null,null,null,null,null,null,null,null,null,null,null,null,null,null,null,null,null,null,null,null,null,null,1,null,2,null,3,null,4,null,5,null,6,null,7,null,8,null,9,null,10]
[null,null,null,{"$f":"IF(EI25=10,\"X\",IF(AND(EI25=0,OR(E32=\"1F\",E32=\"1,2F\")),\"F\",IF(EI25=0,\"G\",IF(AND(EI25=8,E32=\"1○\"),\"⑧\",IF(AND(EI25=7,E32=\"1○\"),\"⑦\",IF(AND(EI25=6,E32=\"1○\"),\"⑥\",IF(AND(EI25=5,E32=\"1○\"),\"⑤\",IF(AND(EI25=4,E32=\"1○\"),\"④\",EI25))))))))","v":"X"},null,null,null,null,{"$f":"IF(AND(EI25<10,EI25+EJ25=10),\"/\",IF(EI25=10,\"\",IF(OR(AND(EJ25=0,E32=\"2F\"),AND(EJ25=0,E32=\"1,2F\")),\"F\",IF(EJ25=0,\"-\",EJ25))))","v":""},null,null,null,null,{"$f":"IF(EK25=10,\"X\",IF(AND(EK25=0,OR(O32=\"1F\",O32=\"1,2F\")),\"F\",IF(EK25=0,\"G\",IF(AND(EK25=8,O32=\"1○\"),\"⑧\",IF(AND(EK25=7,O32=\"1○\"),\"⑦\",IF(AND(EK25=6,O32=\"1○\"),\"⑥\",IF(AND(EK25=5,O32=\"1○\"),\"⑤\",IF(AND(EK25=4,O32=\"1○\"),\"④\",EK25))))))))","v":"X"},null,null,null,null,{"$f":"IF(AND(EK25<10,EK25+EL25=10),\"/\",IF(EK25=10,\"\",IF(OR(AND(EL25=0,O32=\"2F\"),AND(EL25=0,O32=\"1,2F\")),\"F\",IF(EL25=0,\"-\",EL25))))","v":""},null,null,null,null,{"$f":"IF(EM25=10,\"X\",IF(AND(EM25=0,OR(Y32=\"1F\",Y32=\"1,2F\")),\"F\",IF(EM25=0,\"G\",IF(AND(EM25=8,Y32=\"1○\"),\"⑧\",IF(AND(EM25=7,Y32=\"1○\"),\"⑦\",IF(AND(EM25=6,Y32=\"1○\"),\"⑥\",IF(AND(EM25=5,Y32=\"1○\"),\"⑤\",IF(AND(EM25=4,Y32=\"1○\"),\"④\",EM25))))))))","v":"X"},null,null,null,null,{"$f":"IF(AND(EM25<10,EM25+EN25=10),\"/\",IF(EM25=10,\"\",IF(OR(AND(EN25=0,Y32=\"2F\"),AND(EN25=0,Y32=\"1,2F\")),\"F\",IF(EN25=0,\"-\",EN25))))","v":""},null,null,null,null,{"$f":"IF(EO25=10,\"X\",IF(AND(EO25=0,OR(AI32=\"1F\",AI32=\"1,2F\")),\"F\",IF(EO25=0,\"G\",IF(AND(EO25=8,AI32=\"1○\"),\"⑧\",IF(AND(EO25=7,AI32=\"1○\"),\"⑦\",IF(AND(EO25=6,AI32=\"1○\"),\"⑥\",IF(AND(EO25=5,AI32=\"1○\"),\"⑤\",IF(AND(EO25=4,AI32=\"1○\"),\"④\",EO25))))))))","v":"X"},null,null,null,null,{"$f":"IF(AND(EO25<10,EO25+EP25=10),\"/\",IF(EO25=10,\"\",IF(OR(AND(EP25=0,AI32=\"2F\"),AND(EP25=0,AI32=\"1,2F\")),\"F\",IF(EP25=0,\"-\",EP25))))","v":""},null,null,null,null,{"$f":"IF(EQ25=10,\"X\",IF(AND(EQ25=0,OR(AS32=\"1F\",AS32=\"1,2F\")),\"F\",IF(EQ25=0,\"G\",IF(AND(EQ25=8,AS32=\"1○\"),\"⑧\",IF(AND(EQ25=7,AS32=\"1○\"),\"⑦\",IF(AND(EQ25=6,AS32=\"1○\"),\"⑥\",IF(AND(EQ25=5,AS32=\"1○\"),\"⑤\",IF(AND(EQ25=4,AS32=\"1○\"),\"④\",EQ25))))))))","v":"X"},null,null,null,null,{"$f":"IF(AND(EQ25<10,EQ25+ER25=10),\"/\",IF(EQ25=10,\"\",IF(OR(AND(ER25=0,AS32=\"2F\"),AND(ER25=0,AS32=\"1,2F\")),\"F\",IF(ER25=0,\"-\",ER25))))","v":""},null,null,null,null,{"$f":"IF(ES25=10,\"X\",IF(AND(ES25=0,OR(BC32=\"1F\",BC32=\"1,2F\")),\"F\",IF(ES25=0,\"G\",IF(AND(ES25=8,BC32=\"1○\"),\"⑧\",IF(AND(ES25=7,BC32=\"1○\"),\"⑦\",IF(AND(ES25=6,BC32=\"1○\"),\"⑥\",IF(AND(ES25=5,BC32=\"1○\"),\"⑤\",IF(AND(ES25=4,BC32=\"1○\"),\"④\",ES25))))))))","v":"X"},null,null,null,null,{"$f":"IF(AND(ES25<10,ES25+ET25=10),\"/\",IF(ES25=10,\"\",IF(OR(AND(ET25=0,BC32=\"2F\"),AND(ET25=0,BC32=\"1,2F\")),\"F\",IF(ET25=0,\"-\",ET25))))","v":""},null,null,null,null,{"$f":"IF(EU25=10,\"X\",IF(AND(EU25=0,OR(BM32=\"1F\",BM32=\"1,2F\")),\"F\",IF(EU25=0,\"G\",IF(AND(EU25=8,BM32=\"1○\"),\"⑧\",IF(AND(EU25=7,BM32=\"1○\"),\"⑦\",IF(AND(EU25=6,BM32=\"1○\"),\"⑥\",IF(AND(EU25=5,BM32=\"1○\"),\"⑤\",IF(AND(EU25=4,BM32=\"1○\"),\"④\",EU25))))))))","v":"X"},null,null,null,null,{"$f":"IF(AND(EU25<10,EU25+EV25=10),\"/\",IF(EU25=10,\"\",IF(OR(AND(EV25=0,BM32=\"2F\"),AND(EV25=0,BM32=\"1,2F\")),\"F\",IF(EV25=0,\"-\",EV25))))","v":""},null,null,null,null,{"$f":"IF(EW25=10,\"X\",IF(AND(EW25=0,OR(BW32=\"1F\",BW32=\"1,2F\")),\"F\",IF(EW25=0,\"G\",IF(AND(EW25=8,BW32=\"1○\"),\"⑧\",IF(AND(EW25=7,BW32=\"1○\"),\"⑦\",IF(AND(EW25=6,BW32=\"1○\"),\"⑥\",IF(AND(EW25=5,BW32=\"1○\"),\"⑤\",IF(AND(EW25=4,BW32=\"1○\"),\"④\",EW25))))))))","v":"X"},null,null,null,null,{"$f":"IF(AND(EW25<10,EW25+EX25=10),\"/\",IF(EW25=10,\"\",IF(OR(AND(EX25=0,BW32=\"2F\"),AND(EX25=0,BW32=\"1,2F\")),\"F\",IF(EX25=0,\"-\",EX25))))","v":""},null,null,null,null,{"$f":"IF(EY25=10,\"X\",IF(AND(EY25=0,OR(CG32=\"1F\",CG32=\"1,2F\")),\"F\",IF(EY25=0,\"G\",IF(AND(EY25=8,CG32=\"1○\"),\"⑧\",IF(AND(EY25=7,CG32=\"1○\"),\"⑦\",IF(AND(EY25=6,CG32=\"1○\"),\"⑥\",IF(AND(EY25=5,CG32=\"1○\"),\"⑤\",IF(AND(EY25=4,CG32=\"1○\"),\"④\",EY25))))))))","v":"X"},null,null,null,null,{"$f":"IF(AND(EY25<10,EY25+EZ25=10),\"/\",IF(EY25=10,\"\",IF(OR(AND(EZ25=0,CG32=\"2F\"),AND(EZ25=0,CG32=\"1,2F\")),\"F\",IF(EZ25=0,\"-\",EZ25))))","v":""},null,null,null,null,{"$f":"IF(FA25=10,\"X\",IF(AND(FA25=0,OR(CQ32=\"1F\",CQ32=\"1,2F\")),\"F\",IF(FA25=0,\"G\",IF(AND(FA25=8,CQ32=\"1○\"),\"⑧\",IF(AND(FA25=7,CQ32=\"1○\"),\"⑦\",IF(AND(FA25=6,CQ32=\"1○\"),\"⑥\",IF(AND(FA25=5,CQ32=\"1○\"),\"⑤\",IF(AND(FA25=4,CQ32=\"1○\"),\"④\",FA25))))))))","v":"X"},null,null,null,null,{"$f":"IF(AND(FA25=10,FB25=10),\"X\",IF(AND(FA25<10,FA25+FB25=10),\"/\",IF(OR(AND(FA25=10,FB25=0,DA32=\"1F\"),AND(FA25=10,FB25=0,DA32=\"1,2F\")),\"F\",IF(AND(FA25=10,FB25=0),\"G\",IF(AND(FA25=10,FB25=8,DA32=\"1○\"),\"⑧\",IF(AND(FA25=10,FB25=7,DA32=\"1○\"),\"⑦\",IF(AND(FA25=10,FB25=6,DA32=\"1○\"),\"⑥\",IF(AND(FA25=10,FB25=5,DA32=\"1○\"),\"⑤\",IF(AND(FA25=10,FB25=4,DA32=\"1○\"),\"④\",IF(AND(FA25=10,FB25<10),FB25,IF(OR(AND(FA25<10,FB25=0,CQ32=\"2F\"),AND(FA25<10,FB25=0,CQ32=\"1,2F\")),\"F\",IF(AND(FA25<10,FB25=0),\"-\",FB25))))))))))))","v":"X"},null,null,null,null,{"$f":"IF(FC25=10,\"X\",IF(OR(AND(FB25=10,FC25=8,DK32=\"1○\"),AND(FA25+FB25=10,FC25=8,DA32=\"1○\")),\"⑧\",IF(OR(AND(FB25=10,FC25=7,DK32=\"1○\"),AND(FA25+FB25=10,FC25=7,DA32=\"1○\")),\"⑦\",IF(OR(AND(FB25=10,FC25=6,DK32=\"1○\"),AND(FA25+FB25=10,FC25=6,DA32=\"1○\")),\"⑥\",IF(OR(AND(FB25=10,FC25=5,DK32=\"1○\"),AND(FA25+FB25=10,FC25=5,DA32=\"1○\")),\"⑤\",IF(OR(AND(FB25=10,FC25=4,DK32=\"1○\"),AND(FA25+FB25=10,FC25=4,DA32=\"1○\")),\"④\",IF(OR(AND(FB25=10,FC25=0,DK32=\"1F\"),AND(FB25<10,FC25=0,DA32=\"2F\"),AND(FB25<10,FC25=0,DA32=\"1,2F\")),\"F\",IF(AND(FA25=10,FB25<10,FB25+FC25=10),\"/\",IF(AND(OR(FB25=10,AND(FA25+FB25=10,FA25<10)),FC25=0),\"G\",IF(AND(FA25=10,FB25<10,FC25=0),\"-\",IF(FA25+FB25<10,\"\",FC25)))))))))))","v":"X"},null,null,null,null,"(",null,{"$f":"EH29-EH30","v":0},null,null,null,",",null,{"$f":"IF(FB26=0,(DG25+DS25)-EH31,(DG25+DS25+1)-EH31)","v":0},null,null,null,")",null,{"$f":"COUNTIF(EI26:FA26,\">0\")","v":0},null,null,null,null,null,null,null,null,null,null,null,null,null,null,null,{"$f":"COUNTIF(D27:M32,\"・\")","v":10},{"$f":"COUNTIF(D27:M32,\"○\")","v":0},{"$f":"COUNTIF(N27:W32,\"・\")","v":10},{"$f":"COUNTIF(N27:W32,\"○\")","v":0},{"$f":"COUNTIF(X27:AG32,\"・\")","v":10},{"$f":"COUNTIF(X27:AG32,\"○\")","v":0},{"$f":"COUNTIF(AH27:AQ32,\"・\")","v":10},{"$f":"COUNTIF(AH27:AQ32,\"○\")","v":0},{"$f":"COUNTIF(AR27:BA32,\"・\")","v":10},{"$f":"COUNTIF(AR27:BA32,\"○\")","v":0},{"$f":"COUNTIF(BB27:BK32,\"・\")","v":10},{"$f":"COUNTIF(BB27:BK32,\"○\")","v":0},{"$f":"COUNTIF(BL27:BU32,\"・\")","v":10},{"$f":"COUNTIF(BL27:BU32,\"○\")","v":0},{"$f":"COUNTIF(BV27:CE32,\"・\")","v":10},{"$f":"COUNTIF(BV27:CE32,\"○\")","v":0},{"$f":"COUNTIF(CF27:CO32,\"・\")","v":10},{"$f":"COUNTIF(CF27:CO32,\"○\")","v":0},{"$f":"COUNTIF(CP27:CY32,\"・\")","v":10},{"$f":"IF(FA25=10,COUNTIF(CZ27:DI32,\"・\"),COUNTIF(CP27:CY32,\"○\"))","v":10},{"$f":"IF(AND(FA25=10,FB25=10),COUNTIF(DJ27:DS32,\"・\"),IF(AND(FA25=10,FB25<10),COUNTIF(CZ27:DI32,\"○\"),IF(AND(FA25<10,FA25+FB25=10),COUNTIF(CZ27:DI32,\"・\"),\"0\")))","v":10}]
[null,null,null,{"$f":"IF(AND(EI25=10,EK25=10),20+EM25,IF(AND(EI25=10,EK25<10),10+EK25+EL25,IF(AND(EI25<10,EI25+EJ25=10),10+EK25,EI25+EJ25)))","v":30},null,null,null,null,null,null,null,null,null,{"$f":"IF(AND(EK25=10,EM25=10),D26+20+EO25,IF(AND(EK25=10,EM25<10),D26+10+EM25+EN25,IF(AND(EK25<10,EK25+EL25=10),D26+10+EM25,D26+EK25+EL25)))","v":60},null,null,null,null,null,null,null,null,null,{"$f":"IF(AND(EM25=10,EO25=10),N26+20+EQ25,IF(AND(EM25=10,EO25<10),N26+10+EO25+EP25,IF(AND(EM25<10,EM25+EN25=10),N26+10+EO25,N26+EM25+EN25)))","v":90},null,null,null,null,null,null,null,null,null,{"$f":"IF(AND(EO25=10,EQ25=10),X26+20+ES25,IF(AND(EO25=10,EQ25<10),X26+10+EQ25+ER25,IF(AND(EO25<10,EO25+EP25=10),X26+10+EQ25,X26+EO25+EP25)))","v":120},null,null,null,null,null,null,null,null,null,{"$f":"IF(AND(EQ25=10,ES25=10),AH26+20+EU25,IF(AND(EQ25=10,ES25<10),AH26+10+ES25+ET25,IF(AND(EQ25<10,EQ25+ER25=10),AH26+10+ES25,AH26+EQ25+ER25)))","v":150},null,null,null,null,null,null,null,null,null,{"$f":"IF(AND(ES25=10,EU25=10),AR26+20+EW25,IF(AND(ES25=10,EU25<10),AR26+10+EU25+EV25,IF(AND(ES25<10,ES25+ET25=10),AR26+10+EU25,AR26+ES25+ET25)))","v":180},null,null,null,null,null,null,null,null,null,{"$f":"IF(AND(EU25=10,EW25=10),BB26+20+EY25,IF(AND(EU25=10,EW25<10),BB26+10+EW25+EX25,IF(AND(EU25<10,EU25+EV25=10),BB26+10+EW25,BB26+EU25+EV25)))","v":210},null,null,null,null,null,null,null,null,null,{"$f":"IF(AND(EW25=10,EY25=10),BL26+20+FA25,IF(AND(EW25=10,EY25<10),BL26+10+EY25+EZ25,IF(AND(EW25<10,EW25+EX25=10),BL26+10+EY25,BL26+EW25+EX25)))","v":240},null,null,null,null,null,null,null,null,null,{"$f":"IF(AND(EY25=10,FA25=10),BV26+20+FB25,IF(AND(EY25=10,FA25<10),BV26+10+FA25+FB25,IF(AND(EY25<10,EY25+EZ25=10),BV26+10+FA25,BV26+EY25+EZ25)))","v":270},null,null,null,null,null,null,null,null,null,{"$f":"CF26+FA25+FB25+FC25","v":300},null,null,null,null,null,null,null,null,null,null,null,null,null,null,"〈",null,{"$f":"COUNTIF(D32:DS32,\"P\")+COUNTIF(D32:DS32,\"S\")+COUNTIF(D32:DS32,\"C\")","v":0},null,null,null,",",null,{"$f":"COUNTIF(D32:DS32,\"P\")","v":0},null,null,null,",",null,{"$f":"COUNTIF(EI28:FA28,\"1\")","v":10},null,null,null,"〉",null,{"$f":"COUNTIF(D32:DS32,\"H\")","v":0},null,null,null,null,null,null,null,null,null,{"$f":"COUNTIF(D27:M32,\"●\")","v":0},null,{"$f":"COUNTIF(N27:W32,\"●\")","v":0},null,{"$f":"COUNTIF(X27:AG32,\"●\")","v":0},null,{"$f":"COUNTIF(AH27:AQ32,\"●\")","v":0},null,{"$f":"COUNTIF(AR27:BA32,\"●\")","v":0},null,{"$f":"COUNTIF(BB27:BK32,\"●\")","v":0},null,{"$f":"COUNTIF(BL27:BU32,\"●\")","v":0},null,{"$f":"COUNTIF(BV27:CE32,\"●\")","v":0},null,{"$f":"COUNTIF(CF27:CO32,\"●\")","v":0},null,{"$f":"COUNTIF(CP27:CY32,\"●\")","v":0},{"$f":"COUNTIF(CZ27:DI32,\"●\")","v":0},{"$f":"COUNTIF(DJ27:DS32,\"●\")","v":0}]
[]
[null,null,null,null,"・",null,"・",null,"・",null,"・",null,null,null,"・",null,"・",null,"・",null,"・",null,null,null,"・",null,"・",null,"・",null,"・",null,null,null,"・",null,"・",null,"・",null,"・",null,null,null,"・",null,"・",null,"・",null,"・",null,null,null,"・",null,"・",null,"・",null,"・",null,null,null,"・",null,"・",null,"・",null,"・",null,null,null,"・",null,"・",null,"・",null,"・",null,null,null,"・",null,"・",null,"・",null,"・",null,null,null,"・",null,"・",null,"・",null,"・",null,null,null,"・",null,"・",null,"・",null,"・",null,null,null,"・",null,"・",null,"・",null,"・",null,null,null,null,null,null,null,null,null,null,null,null,null,null,null,null,null,{"$f":"IF(AND(EI25=10,EK25=10),\"1\",\"0\")","v":"1"},null,{"$f":"IF(AND(EK25=10,EM25=10),\"1\",\"0\")","v":"1"},null,{"$f":"IF(AND(EM25=10,EO25=10),\"1\",\"0\")","v":"1"},null,{"$f":"IF(AND(EO25=10,EQ25=10),\"1\",\"0\")","v":"1"},null,{"$f":"IF(AND(EQ25=10,ES25=10),\"1\",\"0\")","v":"1"},null,{"$f":"IF(AND(ES25=10,EU25=10),\"1\",\"0\")","v":"1"},null,{"$f":"IF(AND(EU25=10,EW25=10),\"1\",\"0\")","v":"1"},null,{"$f":"IF(AND(EW25=10,EY25=10),\"1\",\"0\")","v":"1"},null,{"$f":"IF(AND(EY25=10,FA25=10),\"1\",\"0\")","v":"1"},null,{"$f":"IF(AND(FA25=10,FB25=10),\"1\",\"0\")","v":"1"}]
[null,null,null,null,null,"・",null,"・",null,"・",null,null,null,null,null,"・",null,"・",null,"・",null,null,null,null,null,"・",null,"・",null,"・",null,null,null,null,null,"・",null,"・",null,"・",null,null,null,null,null,"・",null,"・",null,"・",null,null,null,null,null,"・",null,"・",null,"・",null,null,null,null,null,"・",null,"・",null,"・",null,null,null,null,null,"・",null,"・",null,"・",null,null,null,null,null,"・",null,"・",null,"・",null,null,null,null,null,"・",null,"・",null,"・",null,null,null,null,null,"・",null,"・",null,"・",null,null,null,null,null,"・",null,"・",null,"・",null,null,null,null,null,null,null,null,null,null,null,null,null,null,null,null,null,{"$f":"COUNTIF(D25:DD25,\"/\")","v":0}]
[null,null,null,null,null,null,"・",null,"・",null,null,null,null,null,null,null,"・",null,"・",null,null,null,null,null,null,null,"・",null,"・",null,null,null,null,null,null,null,"・",null,"・",null,null,null,null,null,null,null,"・",null,"・",null,null,null,null,null,null,null,"・",null,"・",null,null,null,null,null,null,null,"・",null,"・",null,null,null,null,null,null,null,"・",null,"・",null,null,null,null,null,null,null,"・",null,"・",null,null,null,null,null,null,null,"・",null,"・",null,null,null,null,null,null,null,"・",null,"・",null,null,null,null,null,null,null,"・",null,"・",null,null,null,null,null,null,null,null,null,null,null,null,null,null,null,null,null,null,{"$f":"COUNTIF(EI30:FA30,\"1\")","v":0},{"$f":"IF(AND(E32=\"1○\",I25=\"/\"),\"1\",\"0\")","v":"0"},null,{"$f":"IF(AND(O32=\"1○\",S25=\"/\"),\"1\",\"0\")","v":"0"},null,{"$f":"IF(AND(Y32=\"1○\",AC25=\"/\"),\"1\",\"0\")","v":"0"},null,{"$f":"IF(AND(AI32=\"1○\",AM25=\"/\"),\"1\",\"0\")","v":"0"},null,{"$f":"IF(AND(AS32=\"1○\",AW25=\"/\"),\"1\",\"0\")","v":"0"},null,{"$f":"IF(AND(BC32=\"1○\",BG25=\"/\"),\"1\",\"0\")","v":"0"},null,{"$f":"IF(AND(BM32=\"1○\",BQ25=\"/\"),\"1\",\"0\")","v":"0"},null,{"$f":"IF(AND(BW32=\"1○\",CA25=\"/\"),\"1\",\"0\")","v":"0"},null,{"$f":"IF(AND(CG32=\"1○\",CK25=\"/\"),\"1\",\"0\")","v":"0"},null,{"$f":"IF(OR(AND(CQ32=\"1○\",CU25=\"/\"),AND(DA32=\"1○\",CZ25=\"/\")),\"1\",\"0\")","v":"0"}]
[null,null,null,null,null,null,null,"・",null,null,null,null,null,null,null,null,null,"・",null,null,null,null,null,null,null,null,null,"・",null,null,null,null,null,null,null,null,null,"・",null,null,null,null,null,null,null,null,null,"・",null,null,null,null,null,null,null,null,null,"・",null,null,null,null,null,null,null,null,null,"・",null,null,null,null,null,null,null,null,null,"・",null,null,null,null,null,null,null,null,null,"・",null,null,null,null,null,null,null,null,null,"・",null,null,null,null,null,null,null,null,null,"・",null,null,null,null,null,null,null,null,null,"・",null,null,null,null,null,null,null,null,null,null,null,null,null,null,null,null,null,null,null,{"$f":"COUNTIF(EI31:FA31,\"1\")","v":0},{"$f":"IF(AND(E32=\"1○\",EI25+EJ25<10),\"1\",\"0\")","v":"0"},null,{"$f":"IF(AND(O32=\"1○\",EK25+EL25<10),\"1\",\"0\")","v":"0"},null,{"$f":"IF(AND(Y32=\"1○\",EM25+EN25<10),\"1\",\"0\")","v":"0"},null,{"$f":"IF(AND(AI32=\"1○\",EO25+EP25<10),\"1\",\"0\")","v":"0"},null,{"$f":"IF(AND(AS32=\"1○\",EQ25+ER25<10),\"1\",\"0\")","v":"0"},null,{"$f":"IF(AND(BC32=\"1○\",ES25+ET25<10),\"1\",\"0\")","v":"0"},null,{"$f":"IF(AND(BM32=\"1○\",EU25+EV25<10),\"1\",\"0\")","v":"0"},null,{"$f":"IF(AND(BW32=\"1○\",EW25+EX25<10),\"1\",\"0\")","v":"0"},null,{"$f":"IF(AND(CG32=\"1○\",EY25+EZ25<10),\"1\",\"0\")","v":"0"},null,{"$f":"IF(OR(AND(CQ32=\"1○\",FA25+FB25<10),AND(DA32=\"1○\",FB25+FC25<10)),\"1\",\"0\")","v":"0"}]
[]
[]
[null,null,"Player 4",1,null,null,null,null,null,null,null,null,null,2,null,null,null,null,null,null,null,null,null,3,null,null,null,null,null,null,null,null,null,4,null,null,null,null,null,null,null,null,null,5,null,null,null,null,null,null,null,null,null,6,null,null,null,null,null,null,null,null,null,7,null,null,null,null,null,null,null,null,null,8,null,null,null,null,null,null,null,null,null,9,null,null,null,null,null,null,null,null,null,10,null,null,null,null,null,null,null,null,null,null,null,null,null,null,null,null,null,null,null,null,null,null,null,null,null,null,null,null,null,null,null,null,null,null,null,null,null,null,null,null,null,null,null,null,1,null,2,null,3,null,4,null,5,null,6,null,7,null,8,null,9,null,10]
[null,null,null,{"$f":"IF(EI35=10,\"X\",IF(AND(EI35=0,OR(E42=\"1F\",E42=\"1,2F\")),\"F\",IF(EI35=0,\"G\",IF(AND(EI35=8,E42=\"1○\"),\"⑧\",IF(AND(EI35=7,E42=\"1○\"),\"⑦\",IF(AND(EI35=6,E42=\"1○\"),\"⑥\",IF(AND(EI35=5,E42=\"1○\"),\"⑤\",IF(AND(EI35=4,E42=\"1○\"),\"④\",EI35))))))))","v":"X"},null,null,null,null,{"$f":"IF(AND(EI35<10,EI35+EJ35=10),\"/\",IF(EI35=10,\"\",IF(OR(AND(EJ35=0,E42=\"2F\"),AND(EJ35=0,E42=\"1,2F\")),\"F\",IF(EJ35=0,\"-\",EJ35))))","v":""},null,null,null,null,{"$f":"IF(EK35=10,\"X\",IF(AND(EK35=0,OR(O42=\"1F\",O42=\"1,2F\")),\"F\",IF(EK35=0,\"G\",IF(AND(EK35=8,O42=\"1○\"),\"⑧\",IF(AND(EK35=7,O42=\"1○\"),\"⑦\",IF(AND(EK35=6,O42=\"1○\"),\"⑥\",IF(AND(EK35=5,O42=\"1○\"),\"⑤\",IF(AND(EK35=4,O42=\"1○\"),\"④\",EK35))))))))","v":"X"},null,null,null,null,{"$f":"IF(AND(EK35<10,EK35+EL35=10),\"/\",IF(EK35=10,\"\",IF(OR(AND(EL35=0,O42=\"2F\"),AND(EL35=0,O42=\"1,2F\")),\"F\",IF(EL35=0,\"-\",EL35))))","v":""},null,null,null,null,{"$f":"IF(EM35=10,\"X\",IF(AND(EM35=0,OR(Y42=\"1F\",Y42=\"1,2F\")),\"F\",IF(EM35=0,\"G\",IF(AND(EM35=8,Y42=\"1○\"),\"⑧\",IF(AND(EM35=7,Y42=\"1○\"),\"⑦\",IF(AND(EM35=6,Y42=\"1○\"),\"⑥\",IF(AND(EM35=5,Y42=\"1○\"),\"⑤\",IF(AND(EM35=4,Y42=\"1○\"),\"④\",EM35))))))))","v":"X"},null,null,null,null,{"$f":"IF(AND(EM35<10,EM35+EN35=10),\"/\",IF(EM35=10,\"\",IF(OR(AND(EN35=0,Y42=\"2F\"),AND(EN35=0,Y42=\"1,2F\")),\"F\",IF(EN35=0,\"-\",EN35))))","v":""},null,null,null,null,{"$f":"IF(EO35=10,\"X\",IF(AND(EO35=0,OR(AI42=\"1F\",AI42=\"1,2F\")),\"F\",IF(EO35=0,\"G\",IF(AND(EO35=8,AI42=\"1○\"),\"⑧\",IF(AND(EO35=7,AI42=\"1○\"),\"⑦\",IF(AND(EO35=6,AI42=\"1○\"),\"⑥\",IF(AND(EO35=5,AI42=\"1○\"),\"⑤\",IF(AND(EO35=4,AI42=\"1○\"),\"④\",EO35))))))))","v":"X"},null,null,null,null,{"$f":"IF(AND(EO35<10,EO35+EP35=10),\"/\",IF(EO35=10,\"\",IF(OR(AND(EP35=0,AI42=\"2F\"),AND(EP35=0,AI42=\"1,2F\")),\"F\",IF(EP35=0,\"-\",EP35))))","v":""},null,null,null,null,{"$f":"IF(EQ35=10,\"X\",IF(AND(EQ35=0,OR(AS42=\"1F\",AS42=\"1,2F\")),\"F\",IF(EQ35=0,\"G\",IF(AND(EQ35=8,AS42=\"1○\"),\"⑧\",IF(AND(EQ35=7,AS42=\"1○\"),\"⑦\",IF(AND(EQ35=6,AS42=\"1○\"),\"⑥\",IF(AND(EQ35=5,AS42=\"1○\"),\"⑤\",IF(AND(EQ35=4,AS42=\"1○\"),\"④\",EQ35))))))))","v":"X"},null,null,null,null,{"$f":"IF(AND(EQ35<10,EQ35+ER35=10),\"/\",IF(EQ35=10,\"\",IF(OR(AND(ER35=0,AS42=\"2F\"),AND(ER35=0,AS42=\"1,2F\")),\"F\",IF(ER35=0,\"-\",ER35))))","v":""},null,null,null,null,{"$f":"IF(ES35=10,\"X\",IF(AND(ES35=0,OR(BC42=\"1F\",BC42=\"1,2F\")),\"F\",IF(ES35=0,\"G\",IF(AND(ES35=8,BC42=\"1○\"),\"⑧\",IF(AND(ES35=7,BC42=\"1○\"),\"⑦\",IF(AND(ES35=6,BC42=\"1○\"),\"⑥\",IF(AND(ES35=5,BC42=\"1○\"),\"⑤\",IF(AND(ES35=4,BC42=\"1○\"),\"④\",ES35))))))))","v":"X"},null,null,null,null,{"$f":"IF(AND(ES35<10,ES35+ET35=10),\"/\",IF(ES35=10,\"\",IF(OR(AND(ET35=0,BC42=\"2F\"),AND(ET35=0,BC42=\"1,2F\")),\"F\",IF(ET35=0,\"-\",ET35))))","v":""},null,null,null,null,{"$f":"IF(EU35=10,\"X\",IF(AND(EU35=0,OR(BM42=\"1F\",BM42=\"1,2F\")),\"F\",IF(EU35=0,\"G\",IF(AND(EU35=8,BM42=\"1○\"),\"⑧\",IF(AND(EU35=7,BM42=\"1○\"),\"⑦\",IF(AND(EU35=6,BM42=\"1○\"),\"⑥\",IF(AND(EU35=5,BM42=\"1○\"),\"⑤\",IF(AND(EU35=4,BM42=\"1○\"),\"④\",EU35))))))))","v":"X"},null,null,null,null,{"$f":"IF(AND(EU35<10,EU35+EV35=10),\"/\",IF(EU35=10,\"\",IF(OR(AND(EV35=0,BM42=\"2F\"),AND(EV35=0,BM42=\"1,2F\")),\"F\",IF(EV35=0,\"-\",EV35))))","v":""},null,null,null,null,{"$f":"IF(EW35=10,\"X\",IF(AND(EW35=0,OR(BW42=\"1F\",BW42=\"1,2F\")),\"F\",IF(EW35=0,\"G\",IF(AND(EW35=8,BW42=\"1○\"),\"⑧\",IF(AND(EW35=7,BW42=\"1○\"),\"⑦\",IF(AND(EW35=6,BW42=\"1○\"),\"⑥\",IF(AND(EW35=5,BW42=\"1○\"),\"⑤\",IF(AND(EW35=4,BW42=\"1○\"),\"④\",EW35))))))))","v":"X"},null,null,null,null,{"$f":"IF(AND(EW35<10,EW35+EX35=10),\"/\",IF(EW35=10,\"\",IF(OR(AND(EX35=0,BW42=\"2F\"),AND(EX35=0,BW42=\"1,2F\")),\"F\",IF(EX35=0,\"-\",EX35))))","v":""},null,null,null,null,{"$f":"IF(EY35=10,\"X\",IF(AND(EY35=0,OR(CG42=\"1F\",CG42=\"1,2F\")),\"F\",IF(EY35=0,\"G\",IF(AND(EY35=8,CG42=\"1○\"),\"⑧\",IF(AND(EY35=7,CG42=\"1○\"),\"⑦\",IF(AND(EY35=6,CG42=\"1○\"),\"⑥\",IF(AND(EY35=5,CG42=\"1○\"),\"⑤\",IF(AND(EY35=4,CG42=\"1○\"),\"④\",EY35))))))))","v":"X"},null,null,null,null,{"$f":"IF(AND(EY35<10,EY35+EZ35=10),\"/\",IF(EY35=10,\"\",IF(OR(AND(EZ35=0,CG42=\"2F\"),AND(EZ35=0,CG42=\"1,2F\")),\"F\",IF(EZ35=0,\"-\",EZ35))))","v":""},null,null,null,null,{"$f":"IF(FA35=10,\"X\",IF(AND(FA35=0,OR(CQ42=\"1F\",CQ42=\"1,2F\")),\"F\",IF(FA35=0,\"G\",IF(AND(FA35=8,CQ42=\"1○\"),\"⑧\",IF(AND(FA35=7,CQ42=\"1○\"),\"⑦\",IF(AND(FA35=6,CQ42=\"1○\"),\"⑥\",IF(AND(FA35=5,CQ42=\"1○\"),\"⑤\",IF(AND(FA35=4,CQ42=\"1○\"),\"④\",FA35))))))))","v":"X"},null,null,null,null,{"$f":"IF(AND(FA35=10,FB35=10),\"X\",IF(AND(FA35<10,FA35+FB35=10),\"/\",IF(OR(AND(FA35=10,FB35=0,DA42=\"1F\"),AND(FA35=10,FB35=0,DA42=\"1,2F\")),\"F\",IF(AND(FA35=10,FB35=0),\"G\",IF(AND(FA35=10,FB35=8,DA42=\"1○\"),\"⑧\",IF(AND(FA35=10,FB35=7,DA42=\"1○\"),\"⑦\",IF(AND(FA35=10,FB35=6,DA42=\"1○\"),\"⑥\",IF(AND(FA35=10,FB35=5,DA42=\"1○\"),\"⑤\",IF(AND(FA35=10,FB35=4,DA42=\"1○\"),\"④\",IF(AND(FA35=10,FB35<10),FB35,IF(OR(AND(FA35<10,FB35=0,CQ42=\"2F\"),AND(FA35<10,FB35=0,CQ42=\"1,2F\")),\"F\",IF(AND(FA35<10,FB35=0),\"-\",FB35))))))))))))","v":"X"},null,null,null,null,{"$f":"IF(FC35=10,\"X\",IF(OR(AND(FB35=10,FC35=8,DK42=\"1○\"),AND(FA35+FB35=10,FC35=8,DA42=\"1○\")),\"⑧\",IF(OR(AND(FB35=10,FC35=7,DK42=\"1○\"),AND(FA35+FB35=10,FC35=7,DA42=\"1○\")),\"⑦\",IF(OR(AND(FB35=10,FC35=6,DK42=\"1○\"),AND(FA35+FB35=10,FC35=6,DA42=\"1○\")),\"⑥\",IF(OR(AND(FB35=10,FC35=5,DK42=\"1○\"),AND(FA35+FB35=10,FC35=5,DA42=\"1○\")),\"⑤\",IF(OR(AND(FB35=10,FC35=4,DK42=\"1○\"),AND(FA35+FB35=10,FC35=4,DA42=\"1○\")),\"④\",IF(OR(AND(FB35=10,FC35=0,DK42=\"1F\"),AND(FB35<10,FC35=0,DA42=\"2F\"),AND(FB35<10,FC35=0,DA42=\"1,2F\")),\"F\",IF(AND(FA35=10,FB35<10,FB35+FC35=10),\"/\",IF(AND(OR(FB35=10,AND(FA35+FB35=10,FA35<10)),FC35=0),\"G\",IF(AND(FA35=10,FB35<10,FC35=0),\"-\",IF(FA35+FB35<10,\"\",FC35)))))))))))","v":"X"},null,null,null,null,"(",null,{"$f":"EH39-EH40","v":0},null,null,null,",",null,{"$f":"IF(FB36=0,(DG35+DS35)-EH41,(DG35+DS35+1)-EH41)","v":0},null,null,null,")",null,{"$f":"COUNTIF(EI36:FA36,\">0\")","v":0},null,null,null,null,null,null,null,null,null,null,null,null,null,null,null,{"$f":"COUNTIF(D37:M42,\"・\")","v":10},{"$f":"COUNTIF(D37:M42,\"○\")","v":0},{"$f":"COUNTIF(N37:W42,\"・\")","v":10},{"$f":"COUNTIF(N37:W42,\"○\")","v":0},{"$f":"COUNTIF(X37:AG42,\"・\")","v":10},{"$f":"COUNTIF(X37:AG42,\"○\")","v":0},{"$f":"COUNTIF(AH37:AQ42,\"・\")","v":10},{"$f":"COUNTIF(AH37:AQ42,\"○\")","v":0},{"$f":"COUNTIF(AR37:BA42,\"・\")","v":10},{"$f":"COUNTIF(AR37:BA42,\"○\")","v":0},{"$f":"COUNTIF(BB37:BK42,\"・\")","v":10},{"$f":"COUNTIF(BB37:BK42,\"○\")","v":0},{"$f":"COUNTIF(BL37:BU42,\"・\")","v":10},{"$f":"COUNTIF(BL37:BU42,\"○\")","v":0},{"$f":"COUNTIF(BV37:CE42,\"・\")","v":10},{"$f":"COUNTIF(BV37:CE42,\"○\")","v":0},{"$f":"COUNTIF(CF37:CO42,\"・\")","v":10},{"$f":"COUNTIF(CF37:CO42,\"○\")","v":0},{"$f":"COUNTIF(CP37:CY42,\"・\")","v":10},{"$f":"IF(FA35=10,COUNTIF(CZ37:DI42,\"・\"),COUNTIF(CP37:CY42,\"○\"))","v":10},{"$f":"IF(AND(FA35=10,FB35=10),COUNTIF(DJ37:DS42,\"・\"),IF(AND(FA35=10,FB35<10),COUNTIF(CZ37:DI42,\"○\"),IF(AND(FA35<10,FA35+FB35=10),COUNTIF(CZ37:DI42,\"・\"),\"0\")))","v":10}]
[null,null,null,{"$f":"IF(AND(EI35=10,EK35=10),20+EM35,IF(AND(EI35=10,EK35<10),10+EK35+EL35,IF(AND(EI35<10,EI35+EJ35=10),10+EK35,EI35+EJ35)))","v":30},null,null,null,null,null,null,null,null,null,{"$f":"IF(AND(EK35=10,EM35=10),D36+20+EO35,IF(AND(EK35=10,EM35<10),D36+10+EM35+EN35,IF(AND(EK35<10,EK35+EL35=10),D36+10+EM35,D36+EK35+EL35)))","v":60},null,null,null,null,null,null,null,null,null,{"$f":"IF(AND(EM35=10,EO35=10),N36+20+EQ35,IF(AND(EM35=10,EO35<10),N36+10+EO35+EP35,IF(AND(EM35<10,EM35+EN35=10),N36+10+EO35,N36+EM35+EN35)))","v":90},null,null,null,null,null,null,null,null,null,{"$f":"IF(AND(EO35=10,EQ35=10),X36+20+ES35,IF(AND(EO35=10,EQ35<10),X36+10+EQ35+ER35,IF(AND(EO35<10,EO35+EP35=10),X36+10+EQ35,X36+EO35+EP35)))","v":120},null,null,null,null,null,null,null,null,null,{"$f":"IF(AND(EQ35=10,ES35=10),AH36+20+EU35,IF(AND(EQ35=10,ES35<10),AH36+10+ES35+ET35,IF(AND(EQ35<10,EQ35+ER35=10),AH36+10+ES35,AH36+EQ35+ER35)))","v":150},null,null,null,null,null,null,null,null,null,{"$f":"IF(AND(ES35=10,EU35=10),AR36+20+EW35,IF(AND(ES35=10,EU35<10),AR36+10+EU35+EV35,IF(AND(ES35<10,ES35+ET35=10),AR36+10+EU35,AR36+ES35+ET35)))","v":180},null,null,null,null,null,null,null,null,null,{"$f":"IF(AND(EU35=10,EW35=10),BB36+20+EY35,IF(AND(EU35=10,EW35<10),BB36+10+EW35+EX35,IF(AND(EU35<10,EU35+EV35=10),BB36+10+EW35,BB36+EU35+EV35)))","v":210},null,null,null,null,null,null,null,null,null,{"$f":"IF(AND(EW35=10,EY35=10),BL36+20+FA35,IF(AND(EW35=10,EY35<10),BL36+10+EY35+EZ35,IF(AND(EW35<10,EW35+EX35=10),BL36+10+EY35,BL36+EW35+EX35)))","v":240},null,null,null,null,null,null,null,null,null,{"$f":"IF(AND(EY35=10,FA35=10),BV36+20+FB35,IF(AND(EY35=10,FA35<10),BV36+10+FA35+FB35,IF(AND(EY35<10,EY35+EZ35=10),BV36+10+FA35,BV36+EY35+EZ35)))","v":270},null,null,null,null,null,null,null,null,null,{"$f":"CF36+FA35+FB35+FC35","v":300},null,null,null,null,null,null,null,null,null,null,null,null,null,null,"〈",null,{"$f":"COUNTIF(D42:DS42,\"P\")+COUNTIF(D42:DS42,\"S\")+COUNTIF(D42:DS42,\"C\")","v":0},null,null,null,",",null,{"$f":"COUNTIF(D42:DS42,\"P\")","v":0},null,null,null,",",null,{"$f":"COUNTIF(EI38:FA38,\"1\")","v":10},null,null,null,"〉",null,{"$f":"COUNTIF(D42:DS42,\"H\")","v":0},null,null,null,null,null,null,null,null,null,{"$f":"COUNTIF(D37:M42,\"●\")","v":0},null,{"$f":"COUNTIF(N37:W42,\"●\")","v":0},null,{"$f":"COUNTIF(X37:AG42,\"●\")","v":0},null,{"$f":"COUNTIF(AH37:AQ42,\"●\")","v":0},null,{"$f":"COUNTIF(AR37:BA42,\"●\")","v":0},null,{"$f":"COUNTIF(BB37:BK42,\"●\")","v":0},null,{"$f":"COUNTIF(BL37:BU42,\"●\")","v":0},null,{"$f":"COUNTIF(BV37:CE42,\"●\")","v":0},null,{"$f":"COUNTIF(CF37:CO42,\"●\")","v":0},null,{"$f":"COUNTIF(CP37:CY42,\"●\")","v":0},{"$f":"COUNTIF(CZ37:DI42,\"●\")","v":0},{"$f":"COUNTIF(DJ37:DS42,\"●\")","v":0}]
[]
[null,null,null,null,"・",null,"・",null,"・",null,"・",null,null,null,"・",null,"・",null,"・",null,"・",null,null,null,"・",null,"・",null,"・",null,"・",null,null,null,"・",null,"・",null,"・",null,"・",null,null,null,"・",null,"・",null,"・",null,"・",null,null,null,"・",null,"・",null,"・",null,"・",null,null,null,"・",null,"・",null,"・",null,"・",null,null,null,"・",null,"・",null,"・",null,"・",null,null,null,"・",null,"・",null,"・",null,"・",null,null,null,"・",null,"・",null,"・",null,"・",null,null,null,"・",null,"・",null,"・",null,"・",null,null,null,"・",null,"・",null,"・",null,"・",null,null,null,null,null,null,null,null,null,null,null,null,null,null,null,null,null,{"$f":"IF(AND(EI35=10,EK35=10),\"1\",\"0\")","v":"1"},null,{"$f":"IF(AND(EK35=10,EM35=10),\"1\",\"0\")","v":"1"},null,{"$f":"IF(AND(EM35=10,EO35=10),\"1\",\"0\")","v":"1"},null,{"$f":"IF(AND(EO35=10,EQ35=10),\"1\",\"0\")","v":"1"},null,{"$f":"IF(AND(EQ35=10,ES35=10),\"1\",\"0\")","v":"1"},null,{"$f":"IF(AND(ES35=10,EU35=10),\"1\",\"0\")","v":"1"},null,{"$f":"IF(AND(EU35=10,EW35=10),\"1\",\"0\")","v":"1"},null,{"$f":"IF(AND(EW35=10,EY35=10),\"1\",\"0\")","v":"1"},null,{"$f":"IF(AND(EY35=10,FA35=10),\"1\",\"0\")","v":"1"},null,{"$f":"IF(AND(FA35=10,FB35=10),\"1\",\"0\")","v":"1"}]
[null,null,null,null,null,"・",null,"・",null,"・",null,null,null,null,null,"・",null,"・",null,"・",null,null,null,null,null,"・",null,"・",null,"・",null,null,null,null,null,"・",null,"・",null,"・",null,null,null,null,null,"・",null,"・",null,"・",null,null,null,null,null,"・",null,"・",null,"・",null,null,null,null,null,"・",null,"・",null,"・",null,null,null,null,null,"・",null,"・",null,"・",null,null,null,null,null,"・",null,"・",null,"・",null,null,null,null,null,"・",null,"・",null,"・",null,null,null,null,null,"・",null,"・",null,"・",null,null,null,null,null,"・",null,"・",null,"・",null,null,null,null,null,null,null,null,null,null,null,null,null,null,null,null,null,{"$f":"COUNTIF(D35:DD35,\"/\")","v":0}]
[null,null,null,null,null,null,"・",null,"・",null,null,null,null,null,null,null,"・",null,"・",null,null,null,null,null,null,null,"・",null,"・",null,null,null,null,null,null,null,"・",null,"・",null,null,null,null,null,null,null,"・",null,"・",null,null,null,null,null,null,null,"・",null,"・",null,null,null,null,null,null,null,"・",null,"・",null,null,null,null,null,null,null,"・",null,"・",null,null,null,null,null,null,null,"・",null,"・",null,null,null,null,null,null,null,"・",null,"・",null,null,null,null,null,null,null,"・",null,"・",null,null,null,null,null,null,null,"・",null,"・",null,null,null,null,null,null,null,null,null,null,null,null,null,null,null,null,null,null,{"$f":"COUNTIF(EI40:FA40,\"1\")","v":0},{"$f":"IF(AND(E42=\"1○\",I35=\"/\"),\"1\",\"0\")","v":"0"},null,{"$f":"IF(AND(O42=\"1○\",S35=\"/\"),\"1\",\"0\")","v":"0"},null,{"$f":"IF(AND(Y42=\"1○\",AC35=\"/\"),\"1\",\"0\")","v":"0"},null,{"$f":"IF(AND(AI42=\"1○\",AM35=\"/\"),\"1\",\"0\")","v":"0"},null,{"$f":"IF(AND(AS42=\"1○\",AW35=\"/\"),\"1\",\"0\")","v":"0"},null,{"$f":"IF(AND(BC42=\"1○\",BG35=\"/\"),\"1\",\"0\")","v":"0"},null,{"$f":"IF(AND(BM42=\"1○\",BQ35=\"/\"),\"1\",\"0\")","v":"0"},null,{"$f":"IF(AND(BW42=\"1○\",CA35=\"/\"),\"1\",\"0\")","v":"0"},null,{"$f":"IF(AND(CG42=\"1○\",CK35=\"/\"),\"1\",\"0\")","v":"0"},null,{"$f":"IF(OR(AND(CQ42=\"1○\",CU35=\"/\"),AND(DA42=\"1○\",CZ35=\"/\")),\"1\",\"0\")","v":"0"}]
[null,null,null,null,null,null,null,"・",null,null,null,null,null,null,null,null,null,"・",null,null,null,null,null,null,null,null,null,"・",null,null,null,null,null,null,null,null,null,"・",null,null,null,null,null,null,null,null,null,"・",null,null,null,null,null,null,null,null,null,"・",null,null,null,null,null,null,null,null,null,"・",null,null,null,null,null,null,null,null,null,"・",null,null,null,null,null,null,null,null,null,"・",null,null,null,null,null,null,null,null,null,"・",null,null,null,null,null,null,null,null,null,"・",null,null,null,null,null,null,null,null,null,"・",null,null,null,null,null,null,null,null,null,null,null,null,null,null,null,null,null,null,null,{"$f":"COUNTIF(EI41:FA41,\"1\")","v":0},{"$f":"IF(AND(E42=\"1○\",EI35+EJ35<10),\"1\",\"0\")","v":"0"},null,{"$f":"IF(AND(O42=\"1○\",EK35+EL35<10),\"1\",\"0\")","v":"0"},null,{"$f":"IF(AND(Y42=\"1○\",EM35+EN35<10),\"1\",\"0\")","v":"0"},null,{"$f":"IF(AND(AI42=\"1○\",EO35+EP35<10),\"1\",\"0\")","v":"0"},null,{"$f":"IF(AND(AS42=\"1○\",EQ35+ER35<10),\"1\",\"0\")","v":"0"},null,{"$f":"IF(AND(BC42=\"1○\",ES35+ET35<10),\"1\",\"0\")","v":"0"},null,{"$f":"IF(AND(BM42=\"1○\",EU35+EV35<10),\"1\",\"0\")","v":"0"},null,{"$f":"IF(AND(BW42=\"1○\",EW35+EX35<10),\"1\",\"0\")","v":"0"},null,{"$f":"IF(AND(CG42=\"1○\",EY35+EZ35<10),\"1\",\"0\")","v":"0"},null,{"$f":"IF(OR(AND(CQ42=\"1○\",FA35+FB35<10),AND(DA42=\"1○\",FB35+FC35<10)),\"1\",\"0\")","v":"0"}]
[]
[]
[null,null,"Player 5",1,null,null,null,null,null,null,null,null,null,2,null,null,null,null,null,null,null,null,null,3,null,null,null,null,null,null,null,null,null,4,null,null,null,null,null,null,null,null,null,5,null,null,null,null,null,null,null,null,null,6,null,null,null,null,null,null,null,null,null,7,null,null,null,null,null,null,null,null,null,8,null,null,null,null,null,null,null,null,null,9,null,null,null,null,null,null,null,null,null,10,null,null,null,null,null,null,null,null,null,null,null,null,null,null,null,null,null,null,null,null,null,null,null,null,null,null,null,null,null,null,null,null,null,null,null,null,null,null,null,null,null,null,null,null,1,null,2,null,3,null,4,null,5,null,6,null,7,null,8,null,9,null,10]
[null,null,null,{"$f":"IF(EI45=10,\"X\",IF(AND(EI45=0,OR(E52=\"1F\",E52=\"1,2F\")),\"F\",IF(EI45=0,\"G\",IF(AND(EI45=8,E52=\"1○\"),\"⑧\",IF(AND(EI45=7,E52=\"1○\"),\"⑦\",IF(AND(EI45=6,E52=\"1○\"),\"⑥\",IF(AND(EI45=5,E52=\"1○\"),\"⑤\",IF(AND(EI45=4,E52=\"1○\"),\"④\",EI45))))))))","v":"X"},null,null,null,null,{"$f":"IF(AND(EI45<10,EI45+EJ45=10),\"/\",IF(EI45=10,\"\",IF(OR(AND(EJ45=0,E52=\"2F\"),AND(EJ45=0,E52=\"1,2F\")),\"F\",IF(EJ45=0,\"-\",EJ45))))","v":""},null,null,null,null,{"$f":"IF(EK45=10,\"X\",IF(AND(EK45=0,OR(O52=\"1F\",O52=\"1,2F\")),\"F\",IF(EK45=0,\"G\",IF(AND(EK45=8,O52=\"1○\"),\"⑧\",IF(AND(EK45=7,O52=\"1○\"),\"⑦\",IF(AND(EK45=6,O52=\"1○\"),\"⑥\",IF(AND(EK45=5,O52=\"1○\"),\"⑤\",IF(AND(EK45=4,O52=\"1○\"),\"④\",EK45))))))))","v":"X"},null,null,null,null,{"$f":"IF(AND(EK45<10,EK45+EL45=10),\"/\",IF(EK45=10,\"\",IF(OR(AND(EL45=0,O52=\"2F\"),AND(EL45=0,O52=\"1,2F\")),\"F\",IF(EL45=0,\"-\",EL45))))","v":""},null,null,null,null,{"$f":"IF(EM45=10,\"X\",IF(AND(EM45=0,OR(Y52=\"1F\",Y52=\"1,2F\")),\"F\",IF(EM45=0,\"G\",IF(AND(EM45=8,Y52=\"1○\"),\"⑧\",IF(AND(EM45=7,Y52=\"1○\"),\"⑦\",IF(AND(EM45=6,Y52=\"1○\"),\"⑥\",IF(AND(EM45=5,Y52=\"1○\"),\"⑤\",IF(AND(EM45=4,Y52=\"1○\"),\"④\",EM45))))))))","v":"X"},null,null,null,null,{"$f":"IF(AND(EM45<10,EM45+EN45=10),\"/\",IF(EM45=10,\"\",IF(OR(AND(EN45=0,Y52=\"2F\"),AND(EN45=0,Y52=\"1,2F\")),\"F\",IF(EN45=0,\"-\",EN45))))","v":""},null,null,null,null,{"$f":"IF(EO45=10,\"X\",IF(AND(EO45=0,OR(AI52=\"1F\",AI52=\"1,2F\")),\"F\",IF(EO45=0,\"G\",IF(AND(EO45=8,AI52=\"1○\"),\"⑧\",IF(AND(EO45=7,AI52=\"1○\"),\"⑦\",IF(AND(EO45=6,AI52=\"1○\"),\"⑥\",IF(AND(EO45=5,AI52=\"1○\"),\"⑤\",IF(AND(EO45=4,AI52=\"1○\"),\"④\",EO45))))))))","v":"X"},null,null,null,null,{"$f":"IF(AND(EO45<10,EO45+EP45=10),\"/\",IF(EO45=10,\"\",IF(OR(AND(EP45=0,AI52=\"2F\"),AND(EP45=0,AI52=\"1,2F\")),\"F\",IF(EP45=0,\"-\",EP45))))","v":""},null,null,null,null,{"$f":"IF(EQ45=10,\"X\",IF(AND(EQ45=0,OR(AS52=\"1F\",AS52=\"1,2F\")),\"F\",IF(EQ45=0,\"G\",IF(AND(EQ45=8,AS52=\"1○\"),\"⑧\",IF(AND(EQ45=7,AS52=\"1○\"),\"⑦\",IF(AND(EQ45=6,AS52=\"1○\"),\"⑥\",IF(AND(EQ45=5,AS52=\"1○\"),\"⑤\",IF(AND(EQ45=4,AS52=\"1○\"),\"④\",EQ45))))))))","v":"X"},null,null,null,null,{"$f":"IF(AND(EQ45<10,EQ45+ER45=10),\"/\",IF(EQ45=10,\"\",IF(OR(AND(ER45=0,AS52=\"2F\"),AND(ER45=0,AS52=\"1,2F\")),\"F\",IF(ER45=0,\"-\",ER45))))","v":""},null,null,null,null,{"$f":"IF(ES45=10,\"X\",IF(AND(ES45=0,OR(BC52=\"1F\",BC52=\"1,2F\")),\"F\",IF(ES45=0,\"G\",IF(AND(ES45=8,BC52=\"1○\"),\"⑧\",IF(AND(ES45=7,BC52=\"1○\"),\"⑦\",IF(AND(ES45=6,BC52=\"1○\"),\"⑥\",IF(AND(ES45=5,BC52=\"1○\"),\"⑤\",IF(AND(ES45=4,BC52=\"1○\"),\"④\",ES45))))))))","v":"X"},null,null,null,null,{"$f":"IF(AND(ES45<10,ES45+ET45=10),\"/\",IF(ES45=10,\"\",IF(OR(AND(ET45=0,BC52=\"2F\"),AND(ET45=0,BC52=\"1,2F\")),\"F\",IF(ET45=0,\"-\",ET45))))","v":""},null,null,null,null,{"$f":"IF(EU45=10,\"X\",IF(AND(EU45=0,OR(BM52=\"1F\",BM52=\"1,2F\")),\"F\",IF(EU45=0,\"G\",IF(AND(EU45=8,BM52=\"1○\"),\"⑧\",IF(AND(EU45=7,BM52=\"1○\"),\"⑦\",IF(AND(EU45=6,BM52=\"1○\"),\"⑥\",IF(AND(EU45=5,BM52=\"1○\"),\"⑤\",IF(AND(EU45=4,BM52=\"1○\"),\"④\",EU45))))))))","v":"X"},null,null,null,null,{"$f":"IF(AND(EU45<10,EU45+EV45=10),\"/\",IF(EU45=10,\"\",IF(OR(AND(EV45=0,BM52=\"2F\"),AND(EV45=0,BM52=\"1,2F\")),\"F\",IF(EV45=0,\"-\",EV45))))","v":""},null,null,null,null,{"$f":"IF(EW45=10,\"X\",IF(AND(EW45=0,OR(BW52=\"1F\",BW52=\"1,2F\")),\"F\",IF(EW45=0,\"G\",IF(AND(EW45=8,BW52=\"1○\"),\"⑧\",IF(AND(EW45=7,BW52=\"1○\"),\"⑦\",IF(AND(EW45=6,BW52=\"1○\"),\"⑥\",IF(AND(EW45=5,BW52=\"1○\"),\"⑤\",IF(AND(EW45=4,BW52=\"1○\"),\"④\",EW45))))))))","v":"X"},null,null,null,null,{"$f":"IF(AND(EW45<10,EW45+EX45=10),\"/\",IF(EW45=10,\"\",IF(OR(AND(EX45=0,BW52=\"2F\"),AND(EX45=0,BW52=\"1,2F\")),\"F\",IF(EX45=0,\"-\",EX45))))","v":""},null,null,null,null,{"$f":"IF(EY45=10,\"X\",IF(AND(EY45=0,OR(CG52=\"1F\",CG52=\"1,2F\")),\"F\",IF(EY45=0,\"G\",IF(AND(EY45=8,CG52=\"1○\"),\"⑧\",IF(AND(EY45=7,CG52=\"1○\"),\"⑦\",IF(AND(EY45=6,CG52=\"1○\"),\"⑥\",IF(AND(EY45=5,CG52=\"1○\"),\"⑤\",IF(AND(EY45=4,CG52=\"1○\"),\"④\",EY45))))))))","v":"X"},null,null,null,null,{"$f":"IF(AND(EY45<10,EY45+EZ45=10),\"/\",IF(EY45=10,\"\",IF(OR(AND(EZ45=0,CG52=\"2F\"),AND(EZ45=0,CG52=\"1,2F\")),\"F\",IF(EZ45=0,\"-\",EZ45))))","v":""},null,null,null,null,{"$f":"IF(FA45=10,\"X\",IF(AND(FA45=0,OR(CQ52=\"1F\",CQ52=\"1,2F\")),\"F\",IF(FA45=0,\"G\",IF(AND(FA45=8,CQ52=\"1○\"),\"⑧\",IF(AND(FA45=7,CQ52=\"1○\"),\"⑦\",IF(AND(FA45=6,CQ52=\"1○\"),\"⑥\",IF(AND(FA45=5,CQ52=\"1○\"),\"⑤\",IF(AND(FA45=4,CQ52=\"1○\"),\"④\",FA45))))))))","v":"X"},null,null,null,null,{"$f":"IF(AND(FA45=10,FB45=10),\"X\",IF(AND(FA45<10,FA45+FB45=10),\"/\",IF(OR(AND(FA45=10,FB45=0,DA52=\"1F\"),AND(FA45=10,FB45=0,DA52=\"1,2F\")),\"F\",IF(AND(FA45=10,FB45=0),\"G\",IF(AND(FA45=10,FB45=8,DA52=\"1○\"),\"⑧\",IF(AND(FA45=10,FB45=7,DA52=\"1○\"),\"⑦\",IF(AND(FA45=10,FB45=6,DA52=\"1○\"),\"⑥\",IF(AND(FA45=10,FB45=5,DA52=\"1○\"),\"⑤\",IF(AND(FA45=10,FB45=4,DA52=\"1○\"),\"④\",IF(AND(FA45=10,FB45<10),FB45,IF(OR(AND(FA45<10,FB45=0,CQ52=\"2F\"),AND(FA45<10,FB45=0,CQ52=\"1,2F\")),\"F\",IF(AND(FA45<10,FB45=0),\"-\",FB45))))))))))))","v":"X"},null,null,null,null,{"$f":"IF(FC45=10,\"X\",IF(OR(AND(FB45=10,FC45=8,DK52=\"1○\"),AND(FA45+FB45=10,FC45=8,DA52=\"1○\")),\"⑧\",IF(OR(AND(FB45=10,FC45=7,DK52=\"1○\"),AND(FA45+FB45=10,FC45=7,DA52=\"1○\")),\"⑦\",IF(OR(AND(FB45=10,FC45=6,DK52=\"1○\"),AND(FA45+FB45=10,FC45=6,DA52=\"1○\")),\"⑥\",IF(OR(AND(FB45=10,FC45=5,DK52=\"1○\"),AND(FA45+FB45=10,FC45=5,DA52=\"1○\")),\"⑤\",IF(OR(AND(FB45=10,FC45=4,DK52=\"1○\"),AND(FA45+FB45=10,FC45=4,DA52=\"1○\")),\"④\",IF(OR(AND(FB45=10,FC45=0,DK52=\"1F\"),AND(FB45<10,FC45=0,DA52=\"2F\"),AND(FB45<10,FC45=0,DA52=\"1,2F\")),\"F\",IF(AND(FA45=10,FB45<10,FB45+FC45=10),\"/\",IF(AND(OR(FB45=10,AND(FA45+FB45=10,FA45<10)),FC45=0),\"G\",IF(AND(FA45=10,FB45<10,FC45=0),\"-\",IF(FA45+FB45<10,\"\",FC45)))))))))))","v":"X"},null,null,null,null,"(",null,{"$f":"EH49-EH50","v":0},null,null,null,",",null,{"$f":"IF(FB46=0,(DG45+DS45)-EH51,(DG45+DS45+1)-EH51)","v":0},null,null,null,")",null,{"$f":"COUNTIF(EI46:FA46,\">0\")","v":0},null,null,null,null,null,null,null,null,null,null,null,null,null,null,null,{"$f":"COUNTIF(D47:M52,\"・\")","v":10},{"$f":"COUNTIF(D47:M52,\"○\")","v":0},{"$f":"COUNTIF(N47:W52,\"・\")","v":10},{"$f":"COUNTIF(N47:W52,\"○\")","v":0},{"$f":"COUNTIF(X47:AG52,\"・\")","v":10},{"$f":"COUNTIF(X47:AG52,\"○\")","v":0},{"$f":"COUNTIF(AH47:AQ52,\"・\")","v":10},{"$f":"COUNTIF(AH47:AQ52,\"○\")","v":0},{"$f":"COUNTIF(AR47:BA52,\"・\")","v":10},{"$f":"COUNTIF(AR47:BA52,\"○\")","v":0},{"$f":"COUNTIF(BB47:BK52,\"・\")","v":10},{"$f":"COUNTIF(BB47:BK52,\"○\")","v":0},{"$f":"COUNTIF(BL47:BU52,\"・\")","v":10},{"$f":"COUNTIF(BL47:BU52,\"○\")","v":0},{"$f":"COUNTIF(BV47:CE52,\"・\")","v":10},{"$f":"COUNTIF(BV47:CE52,\"○\")","v":0},{"$f":"COUNTIF(CF47:CO52,\"・\")","v":10},{"$f":"COUNTIF(CF47:CO52,\"○\")","v":0},{"$f":"COUNTIF(CP47:CY52,\"・\")","v":10},{"$f":"IF(FA45=10,COUNTIF(CZ47:DI52,\"・\"),COUNTIF(CP47:CY52,\"○\"))","v":10},{"$f":"IF(AND(FA45=10,FB45=10),COUNTIF(DJ47:DS52,\"・\"),IF(AND(FA45=10,FB45<10),COUNTIF(CZ47:DI52,\"○\"),IF(AND(FA45<10,FA45+FB45=10),COUNTIF(CZ47:DI52,\"・\"),\"0\")))","v":10}]
[null,null,null,{"$f":"IF(AND(EI45=10,EK45=10),20+EM45,IF(AND(EI45=10,EK45<10),10+EK45+EL45,IF(AND(EI45<10,EI45+EJ45=10),10+EK45,EI45+EJ45)))","v":30},null,null,null,null,null,null,null,null,null,{"$f":"IF(AND(EK45=10,EM45=10),D46+20+EO45,IF(AND(EK45=10,EM45<10),D46+10+EM45+EN45,IF(AND(EK45<10,EK45+EL45=10),D46+10+EM45,D46+EK45+EL45)))","v":60},null,null,null,null,null,null,null,null,null,{"$f":"IF(AND(EM45=10,EO45=10),N46+20+EQ45,IF(AND(EM45=10,EO45<10),N46+10+EO45+EP45,IF(AND(EM45<10,EM45+EN45=10),N46+10+EO45,N46+EM45+EN45)))","v":90},null,null,null,null,null,null,null,null,null,{"$f":"IF(AND(EO45=10,EQ45=10),X46+20+ES45,IF(AND(EO45=10,EQ45<10),X46+10+EQ45+ER45,IF(AND(EO45<10,EO45+EP45=10),X46+10+EQ45,X46+EO45+EP45)))","v":120},null,null,null,null,null,null,null,null,null,{"$f":"IF(AND(EQ45=10,ES45=10),AH46+20+EU45,IF(AND(EQ45=10,ES45<10),AH46+10+ES45+ET45,IF(AND(EQ45<10,EQ45+ER45=10),AH46+10+ES45,AH46+EQ45+ER45)))","v":150},null,null,null,null,null,null,null,null,null,{"$f":"IF(AND(ES45=10,EU45=10),AR46+20+EW45,IF(AND(ES45=10,EU45<10),AR46+10+EU45+EV45,IF(AND(ES45<10,ES45+ET45=10),AR46+10+EU45,AR46+ES45+ET45)))","v":180},null,null,null,null,null,null,null,null,null,{"$f":"IF(AND(EU45=10,EW45=10),BB46+20+EY45,IF(AND(EU45=10,EW45<10),BB46+10+EW45+EX45,IF(AND(EU45<10,EU45+EV45=10),BB46+10+EW45,BB46+EU45+EV45)))","v":210},null,null,null,null,null,null,null,null,null,{"$f":"IF(AND(EW45=10,EY45=10),BL46+20+FA45,IF(AND(EW45=10,EY45<10),BL46+10+EY45+EZ45,IF(AND(EW45<10,EW45+EX45=10),BL46+10+EY45,BL46+EW45+EX45)))","v":240},null,null,null,null,null,null,null,null,null,{"$f":"IF(AND(EY45=10,FA45=10),BV46+20+FB45,IF(AND(EY45=10,FA45<10),BV46+10+FA45+FB45,IF(AND(EY45<10,EY45+EZ45=10),BV46+10+FA45,BV46+EY45+EZ45)))","v":270},null,null,null,null,null,null,null,null,null,{"$f":"CF46+FA45+FB45+FC45","v":300},null,null,null,null,null,null,null,null,null,null,null,null,null,null,"〈",null,{"$f":"COUNTIF(D52:DS52,\"P\")+COUNTIF(D52:DS52,\"S\")+COUNTIF(D52:DS52,\"C\")","v":0},null,null,null,",",null,{"$f":"COUNTIF(D52:DS52,\"P\")","v":0},null,null,null,",",null,{"$f":"COUNTIF(EI48:FA48,\"1\")","v":10},null,null,null,"〉",null,{"$f":"COUNTIF(D52:DS52,\"H\")","v":0},null,null,null,null,null,null,null,null,null,{"$f":"COUNTIF(D47:M52,\"●\")","v":0},null,{"$f":"COUNTIF(N47:W52,\"●\")","v":0},null,{"$f":"COUNTIF(X47:AG52,\"●\")","v":0},null,{"$f":"COUNTIF(AH47:AQ52,\"●\")","v":0},null,{"$f":"COUNTIF(AR47:BA52,\"●\")","v":0},null,{"$f":"COUNTIF(BB47:BK52,\"●\")","v":0},null,{"$f":"COUNTIF(BL47:BU52,\"●\")","v":0},null,{"$f":"COUNTIF(BV47:CE52,\"●\")","v":0},null,{"$f":"COUNTIF(CF47:CO52,\"●\")","v":0},null,{"$f":"COUNTIF(CP47:CY52,\"●\")","v":0},{"$f":"COUNTIF(CZ47:DI52,\"●\")","v":0},{"$f":"COUNTIF(DJ47:DS52,\"●\")","v":0}]
[null,"Team Total"]
[null,null,null,null,"・",null,"・",null,"・",null,"・",null,null,null,"・",null,"・",null,"・",null,"・",null,null,null,"・",null,"・",null,"・",null,"・",null,null,null,"・",null,"・",null,"・",null,"・",null,null,null,"・",null,"・",null,"・",null,"・",null,null,null,"・",null,"・",null,"・",null,"・",null,null,null,"・",null,"・",null,"・",null,"・",null,null,null,"・",null,"・",null,"・",null,"・",null,null,null,"・",null,"・",null,"・",null,"・",null,null,null,"・",null,"・",null,"・",null,"・",null,null,null,"・",null,"・",null,"・",null,"・",null,null,null,"・",null,"・",null,"・",null,"・",null,null,null,null,null,null,null,null,null,null,null,null,null,null,null,null,null,{"$f":"IF(AND(EI45=10,EK45=10),\"1\",\"0\")","v":"1"},null,{"$f":"IF(AND(EK45=10,EM45=10),\"1\",\"0\")","v":"1"},null,{"$f":"IF(AND(EM45=10,EO45=10),\"1\",\"0\")","v":"1"},null,{"$f":"IF(AND(EO45=10,EQ45=10),\"1\",\"0\")","v":"1"},null,{"$f":"IF(AND(EQ45=10,ES45=10),\"1\",\"0\")","v":"1"},null,{"$f":"IF(AND(ES45=10,EU45=10),\"1\",\"0\")","v":"1"},null,{"$f":"IF(AND(EU45=10,EW45=10),\"1\",\"0\")","v":"1"},null,{"$f":"IF(AND(EW45=10,EY45=10),\"1\",\"0\")","v":"1"},null,{"$f":"IF(AND(EY45=10,FA45=10),\"1\",\"0\")","v":"1"},null,{"$f":"IF(AND(FA45=10,FB45=10),\"1\",\"0\")","v":"1"}]
[null,null,null,null,null,"・",null,"・",null,"・",null,null,null,null,null,"・",null,"・",null,"・",null,null,null,null,null,"・",null,"・",null,"・",null,null,null,null,null,"・",null,"・",null,"・",null,null,null,null,null,"・",null,"・",null,"・",null,null,null,null,null,"・",null,"・",null,"・",null,null,null,null,null,"・",null,"・",null,"・",null,null,null,null,null,"・",null,"・",null,"・",null,null,null,null,null,"・",null,"・",null,"・",null,null,null,null,null,"・",null,"・",null,"・",null,null,null,null,null,"・",null,"・",null,"・",null,null,null,null,null,"・",null,"・",null,"・",null,null,null,null,null,null,null,null,null,null,null,null,null,null,null,null,null,{"$f":"COUNTIF(D45:DD45,\"/\")","v":0}]
[null,{"$f":"CP6+CP16+CP26+CP36+CP46","v":1500},null,null,null,null,"・",null,"・",null,null,null,null,null,null,null,"・",null,"・",null,null,null,null,null,null,null,"・",null,"・",null,null,null,null,null,null,null,"・",null,"・",null,null,null,null,null,null,null,"・",null,"・",null,null,null,null,null,null,null,"・",null,"・",null,null,null,null,null,null,null,"・",null,"・",null,null,null,null,null,null,null,"・",null,"・",null,null,null,null,null,null,null,"・",null,"・",null,null,null,null,null,null,null,"・",null,"・",null,null,null,null,null,null,null,"・",null,"・",null,null,null,null,null,null,null,"・",null,"・",null,null,null,null,null,null,null,null,null,null,null,null,null,null,null,null,null,null,{"$f":"COUNTIF(EI50:FA50,\"1\")","v":0},{"$f":"IF(AND(E52=\"1○\",I45=\"/\"),\"1\",\"0\")","v":"0"},null,{"$f":"IF(AND(O52=\"1○\",S45=\"/\"),\"1\",\"0\")","v":"0"},null,{"$f":"IF(AND(Y52=\"1○\",AC45=\"/\"),\"1\",\"0\")","v":"0"},null,{"$f":"IF(AND(AI52=\"1○\",AM45=\"/\"),\"1\",\"0\")","v":"0"},null,{"$f":"IF(AND(AS52=\"1○\",AW45=\"/\"),\"1\",\"0\")","v":"0"},null,{"$f":"IF(AND(BC52=\"1○\",BG45=\"/\"),\"1\",\"0\")","v":"0"},null,{"$f":"IF(AND(BM52=\"1○\",BQ45=\"/\"),\"1\",\"0\")","v":"0"},null,{"$f":"IF(AND(BW52=\"1○\",CA45=\"/\"),\"1\",\"0\")","v":"0"},null,{"$f":"IF(AND(CG52=\"1○\",CK45=\"/\"),\"1\",\"0\")","v":"0"},null,{"$f":"IF(OR(AND(CQ52=\"1○\",CU45=\"/\"),AND(DA52=\"1○\",CZ45=\"/\")),\"1\",\"0\")","v":"0"}]
[null,null,null,null,null,null,null,"・",null,null,null,null,null,null,null,null,null,"・",null,null,null,null,null,null,null,null,null,"・",null,null,null,null,null,null,null,null,null,"・",null,null,null,null,null,null,null,null,null,"・",null,null,null,null,null,null,null,null,null,"・",null,null,null,null,null,null,null,null,null,"・",null,null,null,null,null,null,null,null,null,"・",null,null,null,null,null,null,null,null,null,"・",null,null,null,null,null,null,null,null,null,"・",null,null,null,null,null,null,null,null,null,"・",null,null,null,null,null,null,null,null,null,"・",null,null,null,null,null,null,null,null,null,null,null,null,null,null,null,null,null,null,null,{"$f":"COUNTIF(EI51:FA51,\"1\")","v":0},{"$f":"IF(AND(E52=\"1○\",EI45+EJ45<10),\"1\",\"0\")","v":"0"},null,{"$f":"IF(AND(O52=\"1○\",EK45+EL45<10),\"1\",\"0\")","v":"0"},null,{"$f":"IF(AND(Y52=\"1○\",EM45+EN45<10),\"1\",\"0\")","v":"0"},null,{"$f":"IF(AND(AI52=\"1○\",EO45+EP45<10),\"1\",\"0\")","v":"0"},null,{"$f":"IF(AND(AS52=\"1○\",EQ45+ER45<10),\"1\",\"0\")","v":"0"},null,{"$f":"IF(AND(BC52=\"1○\",ES45+ET45<10),\"1\",\"0\")","v":"0"},null,{"$f":"IF(AND(BM52=\"1○\",EU45+EV45<10),\"1\",\"0\")","v":"0"},null,{"$f":"IF(AND(BW52=\"1○\",EW45+EX45<10),\"1\",\"0\")","v":"0"},null,{"$f":"IF(AND(CG52=\"1○\",EY45+EZ45<10),\"1\",\"0\")","v":"0"},null,{"$f":"IF(OR(AND(CQ52=\"1○\",FA45+FB45<10),AND(DA52=\"1○\",FB45+FC45<10)),\"1\",\"0\")","v":"0"}]
[]
[]
[null,"相　手　大　学","Player 1",1,null,null,null,null,null,null,null,null,null,2,null,null,null,null,null,null,null,null,null,3,null,null,null,null,null,null,null,null,null,4,null,null,null,null,null,null,null,null,null,5,null,null,null,null,null,null,null,null,null,6,null,null,null,null,null,null,null,null,null,7,null,null,null,null,null,null,null,null,null,8,null,null,null,null,null,null,null,null,null,9,null,null,null,null,null,null,null,null,null,10,null,null,null,null,null,null,null,null,null,null,null,null,null,null,null,null,null,null,null,null,null,null,null,null,null,null,null,null,null,null,null,null,null,null,null,null,null,null,null,null,null,null,null,null,1,null,2,null,3,null,4,null,5,null,6,null,7,null,8,null,9,null,10]
[null,null,null,{"$f":"IF(EI55=10,\"X\",IF(AND(EI55=0,OR(E62=\"1F\",E62=\"1,2F\")),\"F\",IF(EI55=0,\"G\",IF(AND(EI55=8,E62=\"1○\"),\"⑧\",IF(AND(EI55=7,E62=\"1○\"),\"⑦\",IF(AND(EI55=6,E62=\"1○\"),\"⑥\",IF(AND(EI55=5,E62=\"1○\"),\"⑤\",IF(AND(EI55=4,E62=\"1○\"),\"④\",EI55))))))))","v":"X"},null,null,null,null,{"$f":"IF(AND(EI55<10,EI55+EJ55=10),\"/\",IF(EI55=10,\"\",IF(OR(AND(EJ55=0,E62=\"2F\"),AND(EJ55=0,E62=\"1,2F\")),\"F\",IF(EJ55=0,\"-\",EJ55))))","v":""},null,null,null,null,{"$f":"IF(EK55=10,\"X\",IF(AND(EK55=0,OR(O62=\"1F\",O62=\"1,2F\")),\"F\",IF(EK55=0,\"G\",IF(AND(EK55=8,O62=\"1○\"),\"⑧\",IF(AND(EK55=7,O62=\"1○\"),\"⑦\",IF(AND(EK55=6,O62=\"1○\"),\"⑥\",IF(AND(EK55=5,O62=\"1○\"),\"⑤\",IF(AND(EK55=4,O62=\"1○\"),\"④\",EK55))))))))","v":"X"},null,null,null,null,{"$f":"IF(AND(EK55<10,EK55+EL55=10),\"/\",IF(EK55=10,\"\",IF(OR(AND(EL55=0,O62=\"2F\"),AND(EL55=0,O62=\"1,2F\")),\"F\",IF(EL55=0,\"-\",EL55))))","v":""},null,null,null,null,{"$f":"IF(EM55=10,\"X\",IF(AND(EM55=0,OR(Y62=\"1F\",Y62=\"1,2F\")),\"F\",IF(EM55=0,\"G\",IF(AND(EM55=8,Y62=\"1○\"),\"⑧\",IF(AND(EM55=7,Y62=\"1○\"),\"⑦\",IF(AND(EM55=6,Y62=\"1○\"),\"⑥\",IF(AND(EM55=5,Y62=\"1○\"),\"⑤\",IF(AND(EM55=4,Y62=\"1○\"),\"④\",EM55))))))))","v":"X"},null,null,null,null,{"$f":"IF(AND(EM55<10,EM55+EN55=10),\"/\",IF(EM55=10,\"\",IF(OR(AND(EN55=0,Y62=\"2F\"),AND(EN55=0,Y62=\"1,2F\")),\"F\",IF(EN55=0,\"-\",EN55))))","v":""},null,null,null,null,{"$f":"IF(EO55=10,\"X\",IF(AND(EO55=0,OR(AI62=\"1F\",AI62=\"1,2F\")),\"F\",IF(EO55=0,\"G\",IF(AND(EO55=8,AI62=\"1○\"),\"⑧\",IF(AND(EO55=7,AI62=\"1○\"),\"⑦\",IF(AND(EO55=6,AI62=\"1○\"),\"⑥\",IF(AND(EO55=5,AI62=\"1○\"),\"⑤\",IF(AND(EO55=4,AI62=\"1○\"),\"④\",EO55))))))))","v":"X"},null,null,null,null,{"$f":"IF(AND(EO55<10,EO55+EP55=10),\"/\",IF(EO55=10,\"\",IF(OR(AND(EP55=0,AI62=\"2F\"),AND(EP55=0,AI62=\"1,2F\")),\"F\",IF(EP55=0,\"-\",EP55))))","v":""},null,null,null,null,{"$f":"IF(EQ55=10,\"X\",IF(AND(EQ55=0,OR(AS62=\"1F\",AS62=\"1,2F\")),\"F\",IF(EQ55=0,\"G\",IF(AND(EQ55=8,AS62=\"1○\"),\"⑧\",IF(AND(EQ55=7,AS62=\"1○\"),\"⑦\",IF(AND(EQ55=6,AS62=\"1○\"),\"⑥\",IF(AND(EQ55=5,AS62=\"1○\"),\"⑤\",IF(AND(EQ55=4,AS62=\"1○\"),\"④\",EQ55))))))))","v":"X"},null,null,null,null,{"$f":"IF(AND(EQ55<10,EQ55+ER55=10),\"/\",IF(EQ55=10,\"\",IF(OR(AND(ER55=0,AS62=\"2F\"),AND(ER55=0,AS62=\"1,2F\")),\"F\",IF(ER55=0,\"-\",ER55))))","v":""},null,null,null,null,{"$f":"IF(ES55=10,\"X\",IF(AND(ES55=0,OR(BC62=\"1F\",BC62=\"1,2F\")),\"F\",IF(ES55=0,\"G\",IF(AND(ES55=8,BC62=\"1○\"),\"⑧\",IF(AND(ES55=7,BC62=\"1○\"),\"⑦\",IF(AND(ES55=6,BC62=\"1○\"),\"⑥\",IF(AND(ES55=5,BC62=\"1○\"),\"⑤\",IF(AND(ES55=4,BC62=\"1○\"),\"④\",ES55))))))))","v":"X"},null,null,null,null,{"$f":"IF(AND(ES55<10,ES55+ET55=10),\"/\",IF(ES55=10,\"\",IF(OR(AND(ET55=0,BC62=\"2F\"),AND(ET55=0,BC62=\"1,2F\")),\"F\",IF(ET55=0,\"-\",ET55))))","v":""},null,null,null,null,{"$f":"IF(EU55=10,\"X\",IF(AND(EU55=0,OR(BM62=\"1F\",BM62=\"1,2F\")),\"F\",IF(EU55=0,\"G\",IF(AND(EU55=8,BM62=\"1○\"),\"⑧\",IF(AND(EU55=7,BM62=\"1○\"),\"⑦\",IF(AND(EU55=6,BM62=\"1○\"),\"⑥\",IF(AND(EU55=5,BM62=\"1○\"),\"⑤\",IF(AND(EU55=4,BM62=\"1○\"),\"④\",EU55))))))))","v":"X"},null,null,null,null,{"$f":"IF(AND(EU55<10,EU55+EV55=10),\"/\",IF(EU55=10,\"\",IF(OR(AND(EV55=0,BM62=\"2F\"),AND(EV55=0,BM62=\"1,2F\")),\"F\",IF(EV55=0,\"-\",EV55))))","v":""},null,null,null,null,{"$f":"IF(EW55=10,\"X\",IF(AND(EW55=0,OR(BW62=\"1F\",BW62=\"1,2F\")),\"F\",IF(EW55=0,\"G\",IF(AND(EW55=8,BW62=\"1○\"),\"⑧\",IF(AND(EW55=7,BW62=\"1○\"),\"⑦\",IF(AND(EW55=6,BW62=\"1○\"),\"⑥\",IF(AND(EW55=5,BW62=\"1○\"),\"⑤\",IF(AND(EW55=4,BW62=\"1○\"),\"④\",EW55))))))))","v":"X"},null,null,null,null,{"$f":"IF(AND(EW55<10,EW55+EX55=10),\"/\",IF(EW55=10,\"\",IF(OR(AND(EX55=0,BW62=\"2F\"),AND(EX55=0,BW62=\"1,2F\")),\"F\",IF(EX55=0,\"-\",EX55))))","v":""},null,null,null,null,{"$f":"IF(EY55=10,\"X\",IF(AND(EY55=0,OR(CG62=\"1F\",CG62=\"1,2F\")),\"F\",IF(EY55=0,\"G\",IF(AND(EY55=8,CG62=\"1○\"),\"⑧\",IF(AND(EY55=7,CG62=\"1○\"),\"⑦\",IF(AND(EY55=6,CG62=\"1○\"),\"⑥\",IF(AND(EY55=5,CG62=\"1○\"),\"⑤\",IF(AND(EY55=4,CG62=\"1○\"),\"④\",EY55))))))))","v":"X"},null,null,null,null,{"$f":"IF(AND(EY55<10,EY55+EZ55=10),\"/\",IF(EY55=10,\"\",IF(OR(AND(EZ55=0,CG62=\"2F\"),AND(EZ55=0,CG62=\"1,2F\")),\"F\",IF(EZ55=0,\"-\",EZ55))))","v":""},null,null,null,null,{"$f":"IF(FA55=10,\"X\",IF(AND(FA55=0,OR(CQ62=\"1F\",CQ62=\"1,2F\")),\"F\",IF(FA55=0,\"G\",IF(AND(FA55=8,CQ62=\"1○\"),\"⑧\",IF(AND(FA55=7,CQ62=\"1○\"),\"⑦\",IF(AND(FA55=6,CQ62=\"1○\"),\"⑥\",IF(AND(FA55=5,CQ62=\"1○\"),\"⑤\",IF(AND(FA55=4,CQ62=\"1○\"),\"④\",FA55))))))))","v":"X"},null,null,null,null,{"$f":"IF(AND(FA55=10,FB55=10),\"X\",IF(AND(FA55<10,FA55+FB55=10),\"/\",IF(OR(AND(FA55=10,FB55=0,DA62=\"1F\"),AND(FA55=10,FB55=0,DA62=\"1,2F\")),\"F\",IF(AND(FA55=10,FB55=0),\"G\",IF(AND(FA55=10,FB55=8,DA62=\"1○\"),\"⑧\",IF(AND(FA55=10,FB55=7,DA62=\"1○\"),\"⑦\",IF(AND(FA55=10,FB55=6,DA62=\"1○\"),\"⑥\",IF(AND(FA55=10,FB55=5,DA62=\"1○\"),\"⑤\",IF(AND(FA55=10,FB55=4,DA62=\"1○\"),\"④\",IF(AND(FA55=10,FB55<10),FB55,IF(OR(AND(FA55<10,FB55=0,CQ62=\"2F\"),AND(FA55<10,FB55=0,CQ62=\"1,2F\")),\"F\",IF(AND(FA55<10,FB55=0),\"-\",FB55))))))))))))","v":"X"},null,null,null,null,{"$f":"IF(FC55=10,\"X\",IF(OR(AND(FB55=10,FC55=8,DK62=\"1○\"),AND(FA55+FB55=10,FC55=8,DA62=\"1○\")),\"⑧\",IF(OR(AND(FB55=10,FC55=7,DK62=\"1○\"),AND(FA55+FB55=10,FC55=7,DA62=\"1○\")),\"⑦\",IF(OR(AND(FB55=10,FC55=6,DK62=\"1○\"),AND(FA55+FB55=10,FC55=6,DA62=\"1○\")),\"⑥\",IF(OR(AND(FB55=10,FC55=5,DK62=\"1○\"),AND(FA55+FB55=10,FC55=5,DA62=\"1○\")),\"⑤\",IF(OR(AND(FB55=10,FC55=4,DK62=\"1○\"),AND(FA55+FB55=10,FC55=4,DA62=\"1○\")),\"④\",IF(OR(AND(FB55=10,FC55=0,DK62=\"1F\"),AND(FB55<10,FC55=0,DA62=\"2F\"),AND(FB55<10,FC55=0,DA62=\"1,2F\")),\"F\",IF(AND(FA55=10,FB55<10,FB55+FC55=10),\"/\",IF(AND(OR(FB55=10,AND(FA55+FB55=10,FA55<10)),FC55=0),\"G\",IF(AND(FA55=10,FB55<10,FC55=0),\"-\",IF(FA55+FB55<10,\"\",FC55)))))))))))","v":"X"},null,null,null,null,"(",null,{"$f":"EH59-EH60","v":0},null,null,null,",",null,{"$f":"IF(FB56=0,(DG55+DS55)-EH61,(DG55+DS55+1)-EH61)","v":0},null,null,null,")",null,{"$f":"COUNTIF(EI56:FA56,\">0\")","v":0},null,null,null,null,null,null,null,null,null,null,null,null,null,null,null,{"$f":"COUNTIF(D57:M62,\"・\")","v":10},{"$f":"COUNTIF(D57:M62,\"○\")","v":0},{"$f":"COUNTIF(N57:W62,\"・\")","v":10},{"$f":"COUNTIF(N57:W62,\"○\")","v":0},{"$f":"COUNTIF(X57:AG62,\"・\")","v":10},{"$f":"COUNTIF(X57:AG62,\"○\")","v":0},{"$f":"COUNTIF(AH57:AQ62,\"・\")","v":10},{"$f":"COUNTIF(AH57:AQ62,\"○\")","v":0},{"$f":"COUNTIF(AR57:BA62,\"・\")","v":10},{"$f":"COUNTIF(AR57:BA62,\"○\")","v":0},{"$f":"COUNTIF(BB57:BK62,\"・\")","v":10},{"$f":"COUNTIF(BB57:BK62,\"○\")","v":0},{"$f":"COUNTIF(BL57:BU62,\"・\")","v":10},{"$f":"COUNTIF(BL57:BU62,\"○\")","v":0},{"$f":"COUNTIF(BV57:CE62,\"・\")","v":10},{"$f":"COUNTIF(BV57:CE62,\"○\")","v":0},{"$f":"COUNTIF(CF57:CO62,\"・\")","v":10},{"$f":"COUNTIF(CF57:CO62,\"○\")","v":0},{"$f":"COUNTIF(CP57:CY62,\"・\")","v":10},{"$f":"IF(FA55=10,COUNTIF(CZ57:DI62,\"・\"),COUNTIF(CP57:CY62,\"○\"))","v":10},{"$f":"IF(AND(FA55=10,FB55=10),COUNTIF(DJ57:DS62,\"・\"),IF(AND(FA55=10,FB55<10),COUNTIF(CZ57:DI62,\"○\"),IF(AND(FA55<10,FA55+FB55=10),COUNTIF(CZ57:DI62,\"・\"),\"0\")))","v":10}]
[null,null,null,{"$f":"IF(AND(EI55=10,EK55=10),20+EM55,IF(AND(EI55=10,EK55<10),10+EK55+EL55,IF(AND(EI55<10,EI55+EJ55=10),10+EK55,EI55+EJ55)))","v":30},null,null,null,null,null,null,null,null,null,{"$f":"IF(AND(EK55=10,EM55=10),D56+20+EO55,IF(AND(EK55=10,EM55<10),D56+10+EM55+EN55,IF(AND(EK55<10,EK55+EL55=10),D56+10+EM55,D56+EK55+EL55)))","v":60},null,null,null,null,null,null,null,null,null,{"$f":"IF(AND(EM55=10,EO55=10),N56+20+EQ55,IF(AND(EM55=10,EO55<10),N56+10+EO55+EP55,IF(AND(EM55<10,EM55+EN55=10),N56+10+EO55,N56+EM55+EN55)))","v":90},null,null,null,null,null,null,null,null,null,{"$f":"IF(AND(EO55=10,EQ55=10),X56+20+ES55,IF(AND(EO55=10,EQ55<10),X56+10+EQ55+ER55,IF(AND(EO55<10,EO55+EP55=10),X56+10+EQ55,X56+EO55+EP55)))","v":120},null,null,null,null,null,null,null,null,null,{"$f":"IF(AND(EQ55=10,ES55=10),AH56+20+EU55,IF(AND(EQ55=10,ES55<10),AH56+10+ES55+ET55,IF(AND(EQ55<10,EQ55+ER55=10),AH56+10+ES55,AH56+EQ55+ER55)))","v":150},null,null,null,null,null,null,null,null,null,{"$f":"IF(AND(ES55=10,EU55=10),AR56+20+EW55,IF(AND(ES55=10,EU55<10),AR56+10+EU55+EV55,IF(AND(ES55<10,ES55+ET55=10),AR56+10+EU55,AR56+ES55+ET55)))","v":180},null,null,null,null,null,null,null,null,null,{"$f":"IF(AND(EU55=10,EW55=10),BB56+20+EY55,IF(AND(EU55=10,EW55<10),BB56+10+EW55+EX55,IF(AND(EU55<10,EU55+EV55=10),BB56+10+EW55,BB56+EU55+EV55)))","v":210},null,null,null,null,null,null,null,null,null,{"$f":"IF(AND(EW55=10,EY55=10),BL56+20+FA55,IF(AND(EW55=10,EY55<10),BL56+10+EY55+EZ55,IF(AND(EW55<10,EW55+EX55=10),BL56+10+EY55,BL56+EW55+EX55)))","v":240},null,null,null,null,null,null,null,null,null,{"$f":"IF(AND(EY55=10,FA55=10),BV56+20+FB55,IF(AND(EY55=10,FA55<10),BV56+10+FA55+FB55,IF(AND(EY55<10,EY55+EZ55=10),BV56+10+FA55,BV56+EY55+EZ55)))","v":270},null,null,null,null,null,null,null,null,null,{"$f":"CF56+FA55+FB55+FC55","v":300},null,null,null,null,null,null,null,null,null,null,null,null,null,null,"〈",null,{"$f":"COUNTIF(D62:DS62,\"P\")+COUNTIF(D62:DS62,\"S\")+COUNTIF(D62:DS62,\"C\")","v":0},null,null,null,",",null,{"$f":"COUNTIF(D62:DS62,\"P\")","v":0},null,null,null,",",null,{"$f":"COUNTIF(EI58:FA58,\"1\")","v":10},null,null,null,"〉",null,{"$f":"COUNTIF(D62:DS62,\"H\")","v":0},null,null,null,null,null,null,null,null,null,{"$f":"COUNTIF(D57:M62,\"●\")","v":0},null,{"$f":"COUNTIF(N57:W62,\"●\")","v":0},null,{"$f":"COUNTIF(X57:AG62,\"●\")","v":0},null,{"$f":"COUNTIF(AH57:AQ62,\"●\")","v":0},null,{"$f":"COUNTIF(AR57:BA62,\"●\")","v":0},null,{"$f":"COUNTIF(BB57:BK62,\"●\")","v":0},null,{"$f":"COUNTIF(BL57:BU62,\"●\")","v":0},null,{"$f":"COUNTIF(BV57:CE62,\"●\")","v":0},null,{"$f":"COUNTIF(CF57:CO62,\"●\")","v":0},null,{"$f":"COUNTIF(CP57:CY62,\"●\")","v":0},{"$f":"COUNTIF(CZ57:DI62,\"●\")","v":0},{"$f":"COUNTIF(DJ57:DS62,\"●\")","v":0}]
[]
[null,null,null,null,"・",null,"・",null,"・",null,"・",null,null,null,"・",null,"・",null,"・",null,"・",null,null,null,"・",null,"・",null,"・",null,"・",null,null,null,"・",null,"・",null,"・",null,"・",null,null,null,"・",null,"・",null,"・",null,"・",null,null,null,"・",null,"・",null,"・",null,"・",null,null,null,"・",null,"・",null,"・",null,"・",null,null,null,"・",null,"・",null,"・",null,"・",null,null,null,"・",null,"・",null,"・",null,"・",null,null,null,"・",null,"・",null,"・",null,"・",null,null,null,"・",null,"・",null,"・",null,"・",null,null,null,"・",null,"・",null,"・",null,"・",null,null,null,null,null,null,null,null,null,null,null,null,null,null,null,null,null,{"$f":"IF(AND(EI55=10,EK55=10),\"1\",\"0\")","v":"1"},null,{"$f":"IF(AND(EK55=10,EM55=10),\"1\",\"0\")","v":"1"},null,{"$f":"IF(AND(EM55=10,EO55=10),\"1\",\"0\")","v":"1"},null,{"$f":"IF(AND(EO55=10,EQ55=10),\"1\",\"0\")","v":"1"},null,{"$f":"IF(AND(EQ55=10,ES55=10),\"1\",\"0\")","v":"1"},null,{"$f":"IF(AND(ES55=10,EU55=10),\"1\",\"0\")","v":"1"},null,{"$f":"IF(AND(EU55=10,EW55=10),\"1\",\"0\")","v":"1"},null,{"$f":"IF(AND(EW55=10,EY55=10),\"1\",\"0\")","v":"1"},null,{"$f":"IF(AND(EY55=10,FA55=10),\"1\",\"0\")","v":"1"},null,{"$f":"IF(AND(FA55=10,FB55=10),\"1\",\"0\")","v":"1"}]
[null,null,null,null,null,"・",null,"・",null,"・",null,null,null,null,null,"・",null,"・",null,"・",null,null,null,null,null,"・",null,"・",null,"・",null,null,null,null,null,"・",null,"・",null,"・",null,null,null,null,null,"・",null,"・",null,"・",null,null,null,null,null,"・",null,"・",null,"・",null,null,null,null,null,"・",null,"・",null,"・",null,null,null,null,null,"・",null,"・",null,"・",null,null,null,null,null,"・",null,"・",null,"・",null,null,null,null,null,"・",null,"・",null,"・",null,null,null,null,null,"・",null,"・",null,"・",null,null,null,null,null,"・",null,"・",null,"・",null,null,null,null,null,null,null,null,null,null,null,null,null,null,null,null,null,{"$f":"COUNTIF(D55:DD55,\"/\")","v":0}]
[null,null,null,null,null,null,"・",null,"・",null,null,null,null,null,null,null,"・",null,"・",null,null,null,null,null,null,null,"・",null,"・",null,null,null,null,null,null,null,"・",null,"・",null,null,null,null,null,null,null,"・",null,"・",null,null,null,null,null,null,null,"・",null,"・",null,null,null,null,null,null,null,"・",null,"・",null,null,null,null,null,null,null,"・",null,"・",null,null,null,null,null,null,null,"・",null,"・",null,null,null,null,null,null,null,"・",null,"・",null,null,null,null,null,null,null,"・",null,"・",null,null,null,null,null,null,null,"・",null,"・",null,null,null,null,null,null,null,null,null,null,null,null,null,null,null,null,null,null,{"$f":"COUNTIF(EI60:FA60,\"1\")","v":0},{"$f":"IF(AND(E62=\"1○\",I55=\"/\"),\"1\",\"0\")","v":"0"},null,{"$f":"IF(AND(O62=\"1○\",S55=\"/\"),\"1\",\"0\")","v":"0"},null,{"$f":"IF(AND(Y62=\"1○\",AC55=\"/\"),\"1\",\"0\")","v":"0"},null,{"$f":"IF(AND(AI62=\"1○\",AM55=\"/\"),\"1\",\"0\")","v":"0"},null,{"$f":"IF(AND(AS62=\"1○\",AW55=\"/\"),\"1\",\"0\")","v":"0"},null,{"$f":"IF(AND(BC62=\"1○\",BG55=\"/\"),\"1\",\"0\")","v":"0"},null,{"$f":"IF(AND(BM62=\"1○\",BQ55=\"/\"),\"1\",\"0\")","v":"0"},null,{"$f":"IF(AND(BW62=\"1○\",CA55=\"/\"),\"1\",\"0\")","v":"0"},null,{"$f":"IF(AND(CG62=\"1○\",CK55=\"/\"),\"1\",\"0\")","v":"0"},null,{"$f":"IF(OR(AND(CQ62=\"1○\",CU55=\"/\"),AND(DA62=\"1○\",CZ55=\"/\")),\"1\",\"0\")","v":"0"}]
[null,null,null,null,null,null,null,"・",null,null,null,null,null,null,null,null,null,"・",null,null,null,null,null,null,null,null,null,"・",null,null,null,null,null,null,null,null,null,"・",null,null,null,null,null,null,null,null,null,"・",null,null,null,null,null,null,null,null,null,"・",null,null,null,null,null,null,null,null,null,"・",null,null,null,null,null,null,null,null,null,"・",null,null,null,null,null,null,null,null,null,"・",null,null,null,null,null,null,null,null,null,"・",null,null,null,null,null,null,null,null,null,"・",null,null,null,null,null,null,null,null,null,"・",null,null,null,null,null,null,null,null,null,null,null,null,null,null,null,null,null,null,null,{"$f":"COUNTIF(EI61:FA61,\"1\")","v":0},{"$f":"IF(AND(E62=\"1○\",EI55+EJ55<10),\"1\",\"0\")","v":"0"},null,{"$f":"IF(AND(O62=\"1○\",EK55+EL55<10),\"1\",\"0\")","v":"0"},null,{"$f":"IF(AND(Y62=\"1○\",EM55+EN55<10),\"1\",\"0\")","v":"0"},null,{"$f":"IF(AND(AI62=\"1○\",EO55+EP55<10),\"1\",\"0\")","v":"0"},null,{"$f":"IF(AND(AS62=\"1○\",EQ55+ER55<10),\"1\",\"0\")","v":"0"},null,{"$f":"IF(AND(BC62=\"1○\",ES55+ET55<10),\"1\",\"0\")","v":"0"},null,{"$f":"IF(AND(BM62=\"1○\",EU55+EV55<10),\"1\",\"0\")","v":"0"},null,{"$f":"IF(AND(BW62=\"1○\",EW55+EX55<10),\"1\",\"0\")","v":"0"},null,{"$f":"IF(AND(CG62=\"1○\",EY55+EZ55<10),\"1\",\"0\")","v":"0"},null,{"$f":"IF(OR(AND(CQ62=\"1○\",FA55+FB55<10),AND(DA62=\"1○\",FB55+FC55<10)),\"1\",\"0\")","v":"0"}]
[]
[]
[null,null,"Player 2",1,null,null,null,null,null,null,null,null,null,2,null,null,null,null,null,null,null,null,null,3,null,null,null,null,null,null,null,null,null,4,null,null,null,null,null,null,null,null,null,5,null,null,null,null,null,null,null,null,null,6,null,null,null,null,null,null,null,null,null,7,null,null,null,null,null,null,null,null,null,8,null,null,null,null,null,null,null,null,null,9,null,null,null,null,null,null,null,null,null,10,null,null,null,null,null,null,null,null,null,null,null,null,null,null,null,null,null,null,null,null,null,null,null,null,null,null,null,null,null,null,null,null,null,null,null,null,null,null,null,null,null,null,null,null,1,null,2,null,3,null,4,null,5,null,6,null,7,null,8,null,9,null,10]
[null,null,null,{"$f":"IF(EI65=10,\"X\",IF(AND(EI65=0,OR(E72=\"1F\",E72=\"1,2F\")),\"F\",IF(EI65=0,\"G\",IF(AND(EI65=8,E72=\"1○\"),\"⑧\",IF(AND(EI65=7,E72=\"1○\"),\"⑦\",IF(AND(EI65=6,E72=\"1○\"),\"⑥\",IF(AND(EI65=5,E72=\"1○\"),\"⑤\",IF(AND(EI65=4,E72=\"1○\"),\"④\",EI65))))))))","v":"X"},null,null,null,null,{"$f":"IF(AND(EI65<10,EI65+EJ65=10),\"/\",IF(EI65=10,\"\",IF(OR(AND(EJ65=0,E72=\"2F\"),AND(EJ65=0,E72=\"1,2F\")),\"F\",IF(EJ65=0,\"-\",EJ65))))","v":""},null,null,null,null,{"$f":"IF(EK65=10,\"X\",IF(AND(EK65=0,OR(O72=\"1F\",O72=\"1,2F\")),\"F\",IF(EK65=0,\"G\",IF(AND(EK65=8,O72=\"1○\"),\"⑧\",IF(AND(EK65=7,O72=\"1○\"),\"⑦\",IF(AND(EK65=6,O72=\"1○\"),\"⑥\",IF(AND(EK65=5,O72=\"1○\"),\"⑤\",IF(AND(EK65=4,O72=\"1○\"),\"④\",EK65))))))))","v":"X"},null,null,null,null,{"$f":"IF(AND(EK65<10,EK65+EL65=10),\"/\",IF(EK65=10,\"\",IF(OR(AND(EL65=0,O72=\"2F\"),AND(EL65=0,O72=\"1,2F\")),\"F\",IF(EL65=0,\"-\",EL65))))","v":""},null,null,null,null,{"$f":"IF(EM65=10,\"X\",IF(AND(EM65=0,OR(Y72=\"1F\",Y72=\"1,2F\")),\"F\",IF(EM65=0,\"G\",IF(AND(EM65=8,Y72=\"1○\"),\"⑧\",IF(AND(EM65=7,Y72=\"1○\"),\"⑦\",IF(AND(EM65=6,Y72=\"1○\"),\"⑥\",IF(AND(EM65=5,Y72=\"1○\"),\"⑤\",IF(AND(EM65=4,Y72=\"1○\"),\"④\",EM65))))))))","v":"X"},null,null,null,null,{"$f":"IF(AND(EM65<10,EM65+EN65=10),\"/\",IF(EM65=10,\"\",IF(OR(AND(EN65=0,Y72=\"2F\"),AND(EN65=0,Y72=\"1,2F\")),\"F\",IF(EN65=0,\"-\",EN65))))","v":""},null,null,null,null,{"$f":"IF(EO65=10,\"X\",IF(AND(EO65=0,OR(AI72=\"1F\",AI72=\"1,2F\")),\"F\",IF(EO65=0,\"G\",IF(AND(EO65=8,AI72=\"1○\"),\"⑧\",IF(AND(EO65=7,AI72=\"1○\"),\"⑦\",IF(AND(EO65=6,AI72=\"1○\"),\"⑥\",IF(AND(EO65=5,AI72=\"1○\"),\"⑤\",IF(AND(EO65=4,AI72=\"1○\"),\"④\",EO65))))))))","v":"X"},null,null,null,null,{"$f":"IF(AND(EO65<10,EO65+EP65=10),\"/\",IF(EO65=10,\"\",IF(OR(AND(EP65=0,AI72=\"2F\"),AND(EP65=0,AI72=\"1,2F\")),\"F\",IF(EP65=0,\"-\",EP65))))","v":""},null,null,null,null,{"$f":"IF(EQ65=10,\"X\",IF(AND(EQ65=0,OR(AS72=\"1F\",AS72=\"1,2F\")),\"F\",IF(EQ65=0,\"G\",IF(AND(EQ65=8,AS72=\"1○\"),\"⑧\",IF(AND(EQ65=7,AS72=\"1○\"),\"⑦\",IF(AND(EQ65=6,AS72=\"1○\"),\"⑥\",IF(AND(EQ65=5,AS72=\"1○\"),\"⑤\",IF(AND(EQ65=4,AS72=\"1○\"),\"④\",EQ65))))))))","v":"X"},null,null,null,null,{"$f":"IF(AND(EQ65<10,EQ65+ER65=10),\"/\",IF(EQ65=10,\"\",IF(OR(AND(ER65=0,AS72=\"2F\"),AND(ER65=0,AS72=\"1,2F\")),\"F\",IF(ER65=0,\"-\",ER65))))","v":""},null,null,null,null,{"$f":"IF(ES65=10,\"X\",IF(AND(ES65=0,OR(BC72=\"1F\",BC72=\"1,2F\")),\"F\",IF(ES65=0,\"G\",IF(AND(ES65=8,BC72=\"1○\"),\"⑧\",IF(AND(ES65=7,BC72=\"1○\"),\"⑦\",IF(AND(ES65=6,BC72=\"1○\"),\"⑥\",IF(AND(ES65=5,BC72=\"1○\"),\"⑤\",IF(AND(ES65=4,BC72=\"1○\"),\"④\",ES65))))))))","v":"X"},null,null,null,null,{"$f":"IF(AND(ES65<10,ES65+ET65=10),\"/\",IF(ES65=10,\"\",IF(OR(AND(ET65=0,BC72=\"2F\"),AND(ET65=0,BC72=\"1,2F\")),\"F\",IF(ET65=0,\"-\",ET65))))","v":""},null,null,null,null,{"$f":"IF(EU65=10,\"X\",IF(AND(EU65=0,OR(BM72=\"1F\",BM72=\"1,2F\")),\"F\",IF(EU65=0,\"G\",IF(AND(EU65=8,BM72=\"1○\"),\"⑧\",IF(AND(EU65=7,BM72=\"1○\"),\"⑦\",IF(AND(EU65=6,BM72=\"1○\"),\"⑥\",IF(AND(EU65=5,BM72=\"1○\"),\"⑤\",IF(AND(EU65=4,BM72=\"1○\"),\"④\",EU65))))))))","v":"X"},null,null,null,null,{"$f":"IF(AND(EU65<10,EU65+EV65=10),\"/\",IF(EU65=10,\"\",IF(OR(AND(EV65=0,BM72=\"2F\"),AND(EV65=0,BM72=\"1,2F\")),\"F\",IF(EV65=0,\"-\",EV65))))","v":""},null,null,null,null,{"$f":"IF(EW65=10,\"X\",IF(AND(EW65=0,OR(BW72=\"1F\",BW72=\"1,2F\")),\"F\",IF(EW65=0,\"G\",IF(AND(EW65=8,BW72=\"1○\"),\"⑧\",IF(AND(EW65=7,BW72=\"1○\"),\"⑦\",IF(AND(EW65=6,BW72=\"1○\"),\"⑥\",IF(AND(EW65=5,BW72=\"1○\"),\"⑤\",IF(AND(EW65=4,BW72=\"1○\"),\"④\",EW65))))))))","v":"X"},null,null,null,null,{"$f":"IF(AND(EW65<10,EW65+EX65=10),\"/\",IF(EW65=10,\"\",IF(OR(AND(EX65=0,BW72=\"2F\"),AND(EX65=0,BW72=\"1,2F\")),\"F\",IF(EX65=0,\"-\",EX65))))","v":""},null,null,null,null,{"$f":"IF(EY65=10,\"X\",IF(AND(EY65=0,OR(CG72=\"1F\",CG72=\"1,2F\")),\"F\",IF(EY65=0,\"G\",IF(AND(EY65=8,CG72=\"1○\"),\"⑧\",IF(AND(EY65=7,CG72=\"1○\"),\"⑦\",IF(AND(EY65=6,CG72=\"1○\"),\"⑥\",IF(AND(EY65=5,CG72=\"1○\"),\"⑤\",IF(AND(EY65=4,CG72=\"1○\"),\"④\",EY65))))))))","v":"X"},null,null,null,null,{"$f":"IF(AND(EY65<10,EY65+EZ65=10),\"/\",IF(EY65=10,\"\",IF(OR(AND(EZ65=0,CG72=\"2F\"),AND(EZ65=0,CG72=\"1,2F\")),\"F\",IF(EZ65=0,\"-\",EZ65))))","v":""},null,null,null,null,{"$f":"IF(FA65=10,\"X\",IF(AND(FA65=0,OR(CQ72=\"1F\",CQ72=\"1,2F\")),\"F\",IF(FA65=0,\"G\",IF(AND(FA65=8,CQ72=\"1○\"),\"⑧\",IF(AND(FA65=7,CQ72=\"1○\"),\"⑦\",IF(AND(FA65=6,CQ72=\"1○\"),\"⑥\",IF(AND(FA65=5,CQ72=\"1○\"),\"⑤\",IF(AND(FA65=4,CQ72=\"1○\"),\"④\",FA65))))))))","v":"X"},null,null,null,null,{"$f":"IF(AND(FA65=10,FB65=10),\"X\",IF(AND(FA65<10,FA65+FB65=10),\"/\",IF(OR(AND(FA65=10,FB65=0,DA72=\"1F\"),AND(FA65=10,FB65=0,DA72=\"1,2F\")),\"F\",IF(AND(FA65=10,FB65=0),\"G\",IF(AND(FA65=10,FB65=8,DA72=\"1○\"),\"⑧\",IF(AND(FA65=10,FB65=7,DA72=\"1○\"),\"⑦\",IF(AND(FA65=10,FB65=6,DA72=\"1○\"),\"⑥\",IF(AND(FA65=10,FB65=5,DA72=\"1○\"),\"⑤\",IF(AND(FA65=10,FB65=4,DA72=\"1○\"),\"④\",IF(AND(FA65=10,FB65<10),FB65,IF(OR(AND(FA65<10,FB65=0,CQ72=\"2F\"),AND(FA65<10,FB65=0,CQ72=\"1,2F\")),\"F\",IF(AND(FA65<10,FB65=0),\"-\",FB65))))))))))))","v":"X"},null,null,null,null,{"$f":"IF(FC65=10,\"X\",IF(OR(AND(FB65=10,FC65=8,DK72=\"1○\"),AND(FA65+FB65=10,FC65=8,DA72=\"1○\")),\"⑧\",IF(OR(AND(FB65=10,FC65=7,DK72=\"1○\"),AND(FA65+FB65=10,FC65=7,DA72=\"1○\")),\"⑦\",IF(OR(AND(FB65=10,FC65=6,DK72=\"1○\"),AND(FA65+FB65=10,FC65=6,DA72=\"1○\")),\"⑥\",IF(OR(AND(FB65=10,FC65=5,DK72=\"1○\"),AND(FA65+FB65=10,FC65=5,DA72=\"1○\")),\"⑤\",IF(OR(AND(FB65=10,FC65=4,DK72=\"1○\"),AND(FA65+FB65=10,FC65=4,DA72=\"1○\")),\"④\",IF(OR(AND(FB65=10,FC65=0,DK72=\"1F\"),AND(FB65<10,FC65=0,DA72=\"2F\"),AND(FB65<10,FC65=0,DA72=\"1,2F\")),\"F\",IF(AND(FA65=10,FB65<10,FB65+FC65=10),\"/\",IF(AND(OR(FB65=10,AND(FA65+FB65=10,FA65<10)),FC65=0),\"G\",IF(AND(FA65=10,FB65<10,FC65=0),\"-\",IF(FA65+FB65<10,\"\",FC65)))))))))))","v":"X"},null,null,null,null,"(",null,{"$f":"EH69-EH70","v":0},null,null,null,",",null,{"$f":"IF(FB66=0,(DG65+DS65)-EH71,(DG65+DS65+1)-EH71)","v":0},null,null,null,")",null,{"$f":"COUNTIF(EI66:FA66,\">0\")","v":0},null,null,null,null,null,null,null,null,null,null,null,null,null,null,null,{"$f":"COUNTIF(D67:M72,\"・\")","v":10},{"$f":"COUNTIF(D67:M72,\"○\")","v":0},{"$f":"COUNTIF(N67:W72,\"・\")","v":10},{"$f":"COUNTIF(N67:W72,\"○\")","v":0},{"$f":"COUNTIF(X67:AG72,\"・\")","v":10},{"$f":"COUNTIF(X67:AG72,\"○\")","v":0},{"$f":"COUNTIF(AH67:AQ72,\"・\")","v":10},{"$f":"COUNTIF(AH67:AQ72,\"○\")","v":0},{"$f":"COUNTIF(AR67:BA72,\"・\")","v":10},{"$f":"COUNTIF(AR67:BA72,\"○\")","v":0},{"$f":"COUNTIF(BB67:BK72,\"・\")","v":10},{"$f":"COUNTIF(BB67:BK72,\"○\")","v":0},{"$f":"COUNTIF(BL67:BU72,\"・\")","v":10},{"$f":"COUNTIF(BL67:BU72,\"○\")","v":0},{"$f":"COUNTIF(BV67:CE72,\"・\")","v":10},{"$f":"COUNTIF(BV67:CE72,\"○\")","v":0},{"$f":"COUNTIF(CF67:CO72,\"・\")","v":10},{"$f":"COUNTIF(CF67:CO72,\"○\")","v":0},{"$f":"COUNTIF(CP67:CY72,\"・\")","v":10},{"$f":"IF(FA65=10,COUNTIF(CZ67:DI72,\"・\"),COUNTIF(CP67:CY72,\"○\"))","v":10},{"$f":"IF(AND(FA65=10,FB65=10),COUNTIF(DJ67:DS72,\"・\"),IF(AND(FA65=10,FB65<10),COUNTIF(CZ67:DI72,\"○\"),IF(AND(FA65<10,FA65+FB65=10),COUNTIF(CZ67:DI72,\"・\"),\"0\")))","v":10}]
[null,null,null,{"$f":"IF(AND(EI65=10,EK65=10),20+EM65,IF(AND(EI65=10,EK65<10),10+EK65+EL65,IF(AND(EI65<10,EI65+EJ65=10),10+EK65,EI65+EJ65)))","v":30},null,null,null,null,null,null,null,null,null,{"$f":"IF(AND(EK65=10,EM65=10),D66+20+EO65,IF(AND(EK65=10,EM65<10),D66+10+EM65+EN65,IF(AND(EK65<10,EK65+EL65=10),D66+10+EM65,D66+EK65+EL65)))","v":60},null,null,null,null,null,null,null,null,null,{"$f":"IF(AND(EM65=10,EO65=10),N66+20+EQ65,IF(AND(EM65=10,EO65<10),N66+10+EO65+EP65,IF(AND(EM65<10,EM65+EN65=10),N66+10+EO65,N66+EM65+EN65)))","v":90},null,null,null,null,null,null,null,null,null,{"$f":"IF(AND(EO65=10,EQ65=10),X66+20+ES65,IF(AND(EO65=10,EQ65<10),X66+10+EQ65+ER65,IF(AND(EO65<10,EO65+EP65=10),X66+10+EQ65,X66+EO65+EP65)))","v":120},null,null,null,null,null,null,null,null,null,{"$f":"IF(AND(EQ65=10,ES65=10),AH66+20+EU65,IF(AND(EQ65=10,ES65<10),AH66+10+ES65+ET65,IF(AND(EQ65<10,EQ65+ER65=10),AH66+10+ES65,AH66+EQ65+ER65)))","v":150},null,null,null,null,null,null,null,null,null,{"$f":"IF(AND(ES65=10,EU65=10),AR66+20+EW65,IF(AND(ES65=10,EU65<10),AR66+10+EU65+EV65,IF(AND(ES65<10,ES65+ET65=10),AR66+10+EU65,AR66+ES65+ET65)))","v":180},null,null,null,null,null,null,null,null,null,{"$f":"IF(AND(EU65=10,EW65=10),BB66+20+EY65,IF(AND(EU65=10,EW65<10),BB66+10+EW65+EX65,IF(AND(EU65<10,EU65+EV65=10),BB66+10+EW65,BB66+EU65+EV65)))","v":210},null,null,null,null,null,null,null,null,null,{"$f":"IF(AND(EW65=10,EY65=10),BL66+20+FA65,IF(AND(EW65=10,EY65<10),BL66+10+EY65+EZ65,IF(AND(EW65<10,EW65+EX65=10),BL66+10+EY65,BL66+EW65+EX65)))","v":240},null,null,null,null,null,null,null,null,null,{"$f":"IF(AND(EY65=10,FA65=10),BV66+20+FB65,IF(AND(EY65=10,FA65<10),BV66+10+FA65+FB65,IF(AND(EY65<10,EY65+EZ65=10),BV66+10+FA65,BV66+EY65+EZ65)))","v":270},null,null,null,null,null,null,null,null,null,{"$f":"CF66+FA65+FB65+FC65","v":300},null,null,null,null,null,null,null,null,null,null,null,null,null,null,"〈",null,{"$f":"COUNTIF(D72:DS72,\"P\")+COUNTIF(D72:DS72,\"S\")+COUNTIF(D72:DS72,\"C\")","v":0},null,null,null,",",null,{"$f":"COUNTIF(D72:DS72,\"P\")","v":0},null,null,null,",",null,{"$f":"COUNTIF(EI68:FA68,\"1\")","v":10},null,null,null,"〉",null,{"$f":"COUNTIF(D72:DS72,\"H\")","v":0},null,null,null,null,null,null,null,null,null,{"$f":"COUNTIF(D67:M72,\"●\")","v":0},null,{"$f":"COUNTIF(N67:W72,\"●\")","v":0},null,{"$f":"COUNTIF(X67:AG72,\"●\")","v":0},null,{"$f":"COUNTIF(AH67:AQ72,\"●\")","v":0},null,{"$f":"COUNTIF(AR67:BA72,\"●\")","v":0},null,{"$f":"COUNTIF(BB67:BK72,\"●\")","v":0},null,{"$f":"COUNTIF(BL67:BU72,\"●\")","v":0},null,{"$f":"COUNTIF(BV67:CE72,\"●\")","v":0},null,{"$f":"COUNTIF(CF67:CO72,\"●\")","v":0},null,{"$f":"COUNTIF(CP67:CY72,\"●\")","v":0},{"$f":"COUNTIF(CZ67:DI72,\"●\")","v":0},{"$f":"COUNTIF(DJ67:DS72,\"●\")","v":0}]
[]
[null,null,null,null,"・",null,"・",null,"・",null,"・",null,null,null,"・",null,"・",null,"・",null,"・",null,null,null,"・",null,"・",null,"・",null,"・",null,null,null,"・",null,"・",null,"・",null,"・",null,null,null,"・",null,"・",null,"・",null,"・",null,null,null,"・",null,"・",null,"・",null,"・",null,null,null,"・",null,"・",null,"・",null,"・",null,null,null,"・",null,"・",null,"・",null,"・",null,null,null,"・",null,"・",null,"・",null,"・",null,null,null,"・",null,"・",null,"・",null,"・",null,null,null,"・",null,"・",null,"・",null,"・",null,null,null,"・",null,"・",null,"・",null,"・",null,null,null,null,null,null,null,null,null,null,null,null,null,null,null,null,null,{"$f":"IF(AND(EI65=10,EK65=10),\"1\",\"0\")","v":"1"},null,{"$f":"IF(AND(EK65=10,EM65=10),\"1\",\"0\")","v":"1"},null,{"$f":"IF(AND(EM65=10,EO65=10),\"1\",\"0\")","v":"1"},null,{"$f":"IF(AND(EO65=10,EQ65=10),\"1\",\"0\")","v":"1"},null,{"$f":"IF(AND(EQ65=10,ES65=10),\"1\",\"0\")","v":"1"},null,{"$f":"IF(AND(ES65=10,EU65=10),\"1\",\"0\")","v":"1"},null,{"$f":"IF(AND(EU65=10,EW65=10),\"1\",\"0\")","v":"1"},null,{"$f":"IF(AND(EW65=10,EY65=10),\"1\",\"0\")","v":"1"},null,{"$f":"IF(AND(EY65=10,FA65=10),\"1\",\"0\")","v":"1"},null,{"$f":"IF(AND(FA65=10,FB65=10),\"1\",\"0\")","v":"1"}]
[null,null,null,null,null,"・",null,"・",null,"・",null,null,null,null,null,"・",null,"・",null,"・",null,null,null,null,null,"・",null,"・",null,"・",null,null,null,null,null,"・",null,"・",null,"・",null,null,null,null,null,"・",null,"・",null,"・",null,null,null,null,null,"・",null,"・",null,"・",null,null,null,null,null,"・",null,"・",null,"・",null,null,null,null,null,"・",null,"・",null,"・",null,null,null,null,null,"・",null,"・",null,"・",null,null,null,null,null,"・",null,"・",null,"・",null,null,null,null,null,"・",null,"・",null,"・",null,null,null,null,null,"・",null,"・",null,"・",null,null,null,null,null,null,null,null,null,null,null,null,null,null,null,null,null,{"$f":"COUNTIF(D65:DD65,\"/\")","v":0}]
[null,null,null,null,null,null,"・",null,"・",null,null,null,null,null,null,null,"・",null,"・",null,null,null,null,null,null,null,"・",null,"・",null,null,null,null,null,null,null,"・",null,"・",null,null,null,null,null,null,null,"・",null,"・",null,null,null,null,null,null,null,"・",null,"・",null,null,null,null,null,null,null,"・",null,"・",null,null,null,null,null,null,null,"・",null,"・",null,null,null,null,null,null,null,"・",null,"・",null,null,null,null,null,null,null,"・",null,"・",null,null,null,null,null,null,null,"・",null,"・",null,null,null,null,null,null,null,"・",null,"・",null,null,null,null,null,null,null,null,null,null,null,null,null,null,null,null,null,null,{"$f":"COUNTIF(EI70:FA70,\"1\")","v":0},{"$f":"IF(AND(E72=\"1○\",I65=\"/\"),\"1\",\"0\")","v":"0"},null,{"$f":"IF(AND(O72=\"1○\",S65=\"/\"),\"1\",\"0\")","v":"0"},null,{"$f":"IF(AND(Y72=\"1○\",AC65=\"/\"),\"1\",\"0\")","v":"0"},null,{"$f":"IF(AND(AI72=\"1○\",AM65=\"/\"),\"1\",\"0\")","v":"0"},null,{"$f":"IF(AND(AS72=\"1○\",AW65=\"/\"),\"1\",\"0\")","v":"0"},null,{"$f":"IF(AND(BC72=\"1○\",BG65=\"/\"),\"1\",\"0\")","v":"0"},null,{"$f":"IF(AND(BM72=\"1○\",BQ65=\"/\"),\"1\",\"0\")","v":"0"},null,{"$f":"IF(AND(BW72=\"1○\",CA65=\"/\"),\"1\",\"0\")","v":"0"},null,{"$f":"IF(AND(CG72=\"1○\",CK65=\"/\"),\"1\",\"0\")","v":"0"},null,{"$f":"IF(OR(AND(CQ72=\"1○\",CU65=\"/\"),AND(DA72=\"1○\",CZ65=\"/\")),\"1\",\"0\")","v":"0"}]
[null,null,null,null,null,null,null,"・",null,null,null,null,null,null,null,null,null,"・",null,null,null,null,null,null,null,null,null,"・",null,null,null,null,null,null,null,null,null,"・",null,null,null,null,null,null,null,null,null,"・",null,null,null,null,null,null,null,null,null,"・",null,null,null,null,null,null,null,null,null,"・",null,null,null,null,null,null,null,null,null,"・",null,null,null,null,null,null,null,null,null,"・",null,null,null,null,null,null,null,null,null,"・",null,null,null,null,null,null,null,null,null,"・",null,null,null,null,null,null,null,null,null,"・",null,null,null,null,null,null,null,null,null,null,null,null,null,null,null,null,null,null,null,{"$f":"COUNTIF(EI71:FA71,\"1\")","v":0},{"$f":"IF(AND(E72=\"1○\",EI65+EJ65<10),\"1\",\"0\")","v":"0"},null,{"$f":"IF(AND(O72=\"1○\",EK65+EL65<10),\"1\",\"0\")","v":"0"},null,{"$f":"IF(AND(Y72=\"1○\",EM65+EN65<10),\"1\",\"0\")","v":"0"},null,{"$f":"IF(AND(AI72=\"1○\",EO65+EP65<10),\"1\",\"0\")","v":"0"},null,{"$f":"IF(AND(AS72=\"1○\",EQ65+ER65<10),\"1\",\"0\")","v":"0"},null,{"$f":"IF(AND(BC72=\"1○\",ES65+ET65<10),\"1\",\"0\")","v":"0"},null,{"$f":"IF(AND(BM72=\"1○\",EU65+EV65<10),\"1\",\"0\")","v":"0"},null,{"$f":"IF(AND(BW72=\"1○\",EW65+EX65<10),\"1\",\"0\")","v":"0"},null,{"$f":"IF(AND(CG72=\"1○\",EY65+EZ65<10),\"1\",\"0\")","v":"0"},null,{"$f":"IF(OR(AND(CQ72=\"1○\",FA65+FB65<10),AND(DA72=\"1○\",FB65+FC65<10)),\"1\",\"0\")","v":"0"}]
[]
[]
[null,null,"Player 3",1,null,null,null,null,null,null,null,null,null,2,null,null,null,null,null,null,null,null,null,3,null,null,null,null,null,null,null,null,null,4,null,null,null,null,null,null,null,null,null,5,null,null,null,null,null,null,null,null,null,6,null,null,null,null,null,null,null,null,null,7,null,null,null,null,null,null,null,null,null,8,null,null,null,null,null,null,null,null,null,9,null,null,null,null,null,null,null,null,null,10,null,null,null,null,null,null,null,null,null,null,null,null,null,null,null,null,null,null,null,null,null,null,null,null,null,null,null,null,null,null,null,null,null,null,null,null,null,null,null,null,null,null,null,null,1,null,2,null,3,null,4,null,5,null,6,null,7,null,8,null,9,null,10]
[null,null,null,{"$f":"IF(EI75=10,\"X\",IF(AND(EI75=0,OR(E82=\"1F\",E82=\"1,2F\")),\"F\",IF(EI75=0,\"G\",IF(AND(EI75=8,E82=\"1○\"),\"⑧\",IF(AND(EI75=7,E82=\"1○\"),\"⑦\",IF(AND(EI75=6,E82=\"1○\"),\"⑥\",IF(AND(EI75=5,E82=\"1○\"),\"⑤\",IF(AND(EI75=4,E82=\"1○\"),\"④\",EI75))))))))","v":"X"},null,null,null,null,{"$f":"IF(AND(EI75<10,EI75+EJ75=10),\"/\",IF(EI75=10,\"\",IF(OR(AND(EJ75=0,E82=\"2F\"),AND(EJ75=0,E82=\"1,2F\")),\"F\",IF(EJ75=0,\"-\",EJ75))))","v":""},null,null,null,null,{"$f":"IF(EK75=10,\"X\",IF(AND(EK75=0,OR(O82=\"1F\",O82=\"1,2F\")),\"F\",IF(EK75=0,\"G\",IF(AND(EK75=8,O82=\"1○\"),\"⑧\",IF(AND(EK75=7,O82=\"1○\"),\"⑦\",IF(AND(EK75=6,O82=\"1○\"),\"⑥\",IF(AND(EK75=5,O82=\"1○\"),\"⑤\",IF(AND(EK75=4,O82=\"1○\"),\"④\",EK75))))))))","v":"X"},null,null,null,null,{"$f":"IF(AND(EK75<10,EK75+EL75=10),\"/\",IF(EK75=10,\"\",IF(OR(AND(EL75=0,O82=\"2F\"),AND(EL75=0,O82=\"1,2F\")),\"F\",IF(EL75=0,\"-\",EL75))))","v":""},null,null,null,null,{"$f":"IF(EM75=10,\"X\",IF(AND(EM75=0,OR(Y82=\"1F\",Y82=\"1,2F\")),\"F\",IF(EM75=0,\"G\",IF(AND(EM75=8,Y82=\"1○\"),\"⑧\",IF(AND(EM75=7,Y82=\"1○\"),\"⑦\",IF(AND(EM75=6,Y82=\"1○\"),\"⑥\",IF(AND(EM75=5,Y82=\"1○\"),\"⑤\",IF(AND(EM75=4,Y82=\"1○\"),\"④\",EM75))))))))","v":"X"},null,null,null,null,{"$f":"IF(AND(EM75<10,EM75+EN75=10),\"/\",IF(EM75=10,\"\",IF(OR(AND(EN75=0,Y82=\"2F\"),AND(EN75=0,Y82=\"1,2F\")),\"F\",IF(EN75=0,\"-\",EN75))))","v":""},null,null,null,null,{"$f":"IF(EO75=10,\"X\",IF(AND(EO75=0,OR(AI82=\"1F\",AI82=\"1,2F\")),\"F\",IF(EO75=0,\"G\",IF(AND(EO75=8,AI82=\"1○\"),\"⑧\",IF(AND(EO75=7,AI82=\"1○\"),\"⑦\",IF(AND(EO75=6,AI82=\"1○\"),\"⑥\",IF(AND(EO75=5,AI82=\"1○\"),\"⑤\",IF(AND(EO75=4,AI82=\"1○\"),\"④\",EO75))))))))","v":"X"},null,null,null,null,{"$f":"IF(AND(EO75<10,EO75+EP75=10),\"/\",IF(EO75=10,\"\",IF(OR(AND(EP75=0,AI82=\"2F\"),AND(EP75=0,AI82=\"1,2F\")),\"F\",IF(EP75=0,\"-\",EP75))))","v":""},null,null,null,null,{"$f":"IF(EQ75=10,\"X\",IF(AND(EQ75=0,OR(AS82=\"1F\",AS82=\"1,2F\")),\"F\",IF(EQ75=0,\"G\",IF(AND(EQ75=8,AS82=\"1○\"),\"⑧\",IF(AND(EQ75=7,AS82=\"1○\"),\"⑦\",IF(AND(EQ75=6,AS82=\"1○\"),\"⑥\",IF(AND(EQ75=5,AS82=\"1○\"),\"⑤\",IF(AND(EQ75=4,AS82=\"1○\"),\"④\",EQ75))))))))","v":"X"},null,null,null,null,{"$f":"IF(AND(EQ75<10,EQ75+ER75=10),\"/\",IF(EQ75=10,\"\",IF(OR(AND(ER75=0,AS82=\"2F\"),AND(ER75=0,AS82=\"1,2F\")),\"F\",IF(ER75=0,\"-\",ER75))))","v":""},null,null,null,null,{"$f":"IF(ES75=10,\"X\",IF(AND(ES75=0,OR(BC82=\"1F\",BC82=\"1,2F\")),\"F\",IF(ES75=0,\"G\",IF(AND(ES75=8,BC82=\"1○\"),\"⑧\",IF(AND(ES75=7,BC82=\"1○\"),\"⑦\",IF(AND(ES75=6,BC82=\"1○\"),\"⑥\",IF(AND(ES75=5,BC82=\"1○\"),\"⑤\",IF(AND(ES75=4,BC82=\"1○\"),\"④\",ES75))))))))","v":"X"},null,null,null,null,{"$f":"IF(AND(ES75<10,ES75+ET75=10),\"/\",IF(ES75=10,\"\",IF(OR(AND(ET75=0,BC82=\"2F\"),AND(ET75=0,BC82=\"1,2F\")),\"F\",IF(ET75=0,\"-\",ET75))))","v":""},null,null,null,null,{"$f":"IF(EU75=10,\"X\",IF(AND(EU75=0,OR(BM82=\"1F\",BM82=\"1,2F\")),\"F\",IF(EU75=0,\"G\",IF(AND(EU75=8,BM82=\"1○\"),\"⑧\",IF(AND(EU75=7,BM82=\"1○\"),\"⑦\",IF(AND(EU75=6,BM82=\"1○\"),\"⑥\",IF(AND(EU75=5,BM82=\"1○\"),\"⑤\",IF(AND(EU75=4,BM82=\"1○\"),\"④\",EU75))))))))","v":"X"},null,null,null,null,{"$f":"IF(AND(EU75<10,EU75+EV75=10),\"/\",IF(EU75=10,\"\",IF(OR(AND(EV75=0,BM82=\"2F\"),AND(EV75=0,BM82=\"1,2F\")),\"F\",IF(EV75=0,\"-\",EV75))))","v":""},null,null,null,null,{"$f":"IF(EW75=10,\"X\",IF(AND(EW75=0,OR(BW82=\"1F\",BW82=\"1,2F\")),\"F\",IF(EW75=0,\"G\",IF(AND(EW75=8,BW82=\"1○\"),\"⑧\",IF(AND(EW75=7,BW82=\"1○\"),\"⑦\",IF(AND(EW75=6,BW82=\"1○\"),\"⑥\",IF(AND(EW75=5,BW82=\"1○\"),\"⑤\",IF(AND(EW75=4,BW82=\"1○\"),\"④\",EW75))))))))","v":"X"},null,null,null,null,{"$f":"IF(AND(EW75<10,EW75+EX75=10),\"/\",IF(EW75=10,\"\",IF(OR(AND(EX75=0,BW82=\"2F\"),AND(EX75=0,BW82=\"1,2F\")),\"F\",IF(EX75=0,\"-\",EX75))))","v":""},null,null,null,null,{"$f":"IF(EY75=10,\"X\",IF(AND(EY75=0,OR(CG82=\"1F\",CG82=\"1,2F\")),\"F\",IF(EY75=0,\"G\",IF(AND(EY75=8,CG82=\"1○\"),\"⑧\",IF(AND(EY75=7,CG82=\"1○\"),\"⑦\",IF(AND(EY75=6,CG82=\"1○\"),\"⑥\",IF(AND(EY75=5,CG82=\"1○\"),\"⑤\",IF(AND(EY75=4,CG82=\"1○\"),\"④\",EY75))))))))","v":"X"},null,null,null,null,{"$f":"IF(AND(EY75<10,EY75+EZ75=10),\"/\",IF(EY75=10,\"\",IF(OR(AND(EZ75=0,CG82=\"2F\"),AND(EZ75=0,CG82=\"1,2F\")),\"F\",IF(EZ75=0,\"-\",EZ75))))","v":""},null,null,null,null,{"$f":"IF(FA75=10,\"X\",IF(AND(FA75=0,OR(CQ82=\"1F\",CQ82=\"1,2F\")),\"F\",IF(FA75=0,\"G\",IF(AND(FA75=8,CQ82=\"1○\"),\"⑧\",IF(AND(FA75=7,CQ82=\"1○\"),\"⑦\",IF(AND(FA75=6,CQ82=\"1○\"),\"⑥\",IF(AND(FA75=5,CQ82=\"1○\"),\"⑤\",IF(AND(FA75=4,CQ82=\"1○\"),\"④\",FA75))))))))","v":"X"},null,null,null,null,{"$f":"IF(AND(FA75=10,FB75=10),\"X\",IF(AND(FA75<10,FA75+FB75=10),\"/\",IF(OR(AND(FA75=10,FB75=0,DA82=\"1F\"),AND(FA75=10,FB75=0,DA82=\"1,2F\")),\"F\",IF(AND(FA75=10,FB75=0),\"G\",IF(AND(FA75=10,FB75=8,DA82=\"1○\"),\"⑧\",IF(AND(FA75=10,FB75=7,DA82=\"1○\"),\"⑦\",IF(AND(FA75=10,FB75=6,DA82=\"1○\"),\"⑥\",IF(AND(FA75=10,FB75=5,DA82=\"1○\"),\"⑤\",IF(AND(FA75=10,FB75=4,DA82=\"1○\"),\"④\",IF(AND(FA75=10,FB75<10),FB75,IF(OR(AND(FA75<10,FB75=0,CQ82=\"2F\"),AND(FA75<10,FB75=0,CQ82=\"1,2F\")),\"F\",IF(AND(FA75<10,FB75=0),\"-\",FB75))))))))))))","v":"X"},null,null,null,null,{"$f":"IF(FC75=10,\"X\",IF(OR(AND(FB75=10,FC75=8,DK82=\"1○\"),AND(FA75+FB75=10,FC75=8,DA82=\"1○\")),\"⑧\",IF(OR(AND(FB75=10,FC75=7,DK82=\"1○\"),AND(FA75+FB75=10,FC75=7,DA82=\"1○\")),\"⑦\",IF(OR(AND(FB75=10,FC75=6,DK82=\"1○\"),AND(FA75+FB75=10,FC75=6,DA82=\"1○\")),\"⑥\",IF(OR(AND(FB75=10,FC75=5,DK82=\"1○\"),AND(FA75+FB75=10,FC75=5,DA82=\"1○\")),\"⑤\",IF(OR(AND(FB75=10,FC75=4,DK82=\"1○\"),AND(FA75+FB75=10,FC75=4,DA82=\"1○\")),\"④\",IF(OR(AND(FB75=10,FC75=0,DK82=\"1F\"),AND(FB75<10,FC75=0,DA82=\"2F\"),AND(FB75<10,FC75=0,DA82=\"1,2F\")),\"F\",IF(AND(FA75=10,FB75<10,FB75+FC75=10),\"/\",IF(AND(OR(FB75=10,AND(FA75+FB75=10,FA75<10)),FC75=0),\"G\",IF(AND(FA75=10,FB75<10,FC75=0),\"-\",IF(FA75+FB75<10,\"\",FC75)))))))))))","v":"X"},null,null,null,null,"(",null,{"$f":"EH79-EH80","v":0},null,null,null,",",null,{"$f":"IF(FB76=0,(DG75+DS75)-EH81,(DG75+DS75+1)-EH81)","v":0},null,null,null,")",null,{"$f":"COUNTIF(EI76:FA76,\">0\")","v":0},null,null,null,null,null,null,null,null,null,null,null,null,null,null,null,{"$f":"COUNTIF(D77:M82,\"・\")","v":10},{"$f":"COUNTIF(D77:M82,\"○\")","v":0},{"$f":"COUNTIF(N77:W82,\"・\")","v":10},{"$f":"COUNTIF(N77:W82,\"○\")","v":0},{"$f":"COUNTIF(X77:AG82,\"・\")","v":10},{"$f":"COUNTIF(X77:AG82,\"○\")","v":0},{"$f":"COUNTIF(AH77:AQ82,\"・\")","v":10},{"$f":"COUNTIF(AH77:AQ82,\"○\")","v":0},{"$f":"COUNTIF(AR77:BA82,\"・\")","v":10},{"$f":"COUNTIF(AR77:BA82,\"○\")","v":0},{"$f":"COUNTIF(BB77:BK82,\"・\")","v":10},{"$f":"COUNTIF(BB77:BK82,\"○\")","v":0},{"$f":"COUNTIF(BL77:BU82,\"・\")","v":10},{"$f":"COUNTIF(BL77:BU82,\"○\")","v":0},{"$f":"COUNTIF(BV77:CE82,\"・\")","v":10},{"$f":"COUNTIF(BV77:CE82,\"○\")","v":0},{"$f":"COUNTIF(CF77:CO82,\"・\")","v":10},{"$f":"COUNTIF(CF77:CO82,\"○\")","v":0},{"$f":"COUNTIF(CP77:CY82,\"・\")","v":10},{"$f":"IF(FA75=10,COUNTIF(CZ77:DI82,\"・\"),COUNTIF(CP77:CY82,\"○\"))","v":10},{"$f":"IF(AND(FA75=10,FB75=10),COUNTIF(DJ77:DS82,\"・\"),IF(AND(FA75=10,FB75<10),COUNTIF(CZ77:DI82,\"○\"),IF(AND(FA75<10,FA75+FB75=10),COUNTIF(CZ77:DI82,\"・\"),\"0\")))","v":10}]
[null,null,null,{"$f":"IF(AND(EI75=10,EK75=10),20+EM75,IF(AND(EI75=10,EK75<10),10+EK75+EL75,IF(AND(EI75<10,EI75+EJ75=10),10+EK75,EI75+EJ75)))","v":30},null,null,null,null,null,null,null,null,null,{"$f":"IF(AND(EK75=10,EM75=10),D76+20+EO75,IF(AND(EK75=10,EM75<10),D76+10+EM75+EN75,IF(AND(EK75<10,EK75+EL75=10),D76+10+EM75,D76+EK75+EL75)))","v":60},null,null,null,null,null,null,null,null,null,{"$f":"IF(AND(EM75=10,EO75=10),N76+20+EQ75,IF(AND(EM75=10,EO75<10),N76+10+EO75+EP75,IF(AND(EM75<10,EM75+EN75=10),N76+10+EO75,N76+EM75+EN75)))","v":90},null,null,null,null,null,null,null,null,null,{"$f":"IF(AND(EO75=10,EQ75=10),X76+20+ES75,IF(AND(EO75=10,EQ75<10),X76+10+EQ75+ER75,IF(AND(EO75<10,EO75+EP75=10),X76+10+EQ75,X76+EO75+EP75)))","v":120},null,null,null,null,null,null,null,null,null,{"$f":"IF(AND(EQ75=10,ES75=10),AH76+20+EU75,IF(AND(EQ75=10,ES75<10),AH76+10+ES75+ET75,IF(AND(EQ75<10,EQ75+ER75=10),AH76+10+ES75,AH76+EQ75+ER75)))","v":150},null,null,null,null,null,null,null,null,null,{"$f":"IF(AND(ES75=10,EU75=10),AR76+20+EW75,IF(AND(ES75=10,EU75<10),AR76+10+EU75+EV75,IF(AND(ES75<10,ES75+ET75=10),AR76+10+EU75,AR76+ES75+ET75)))","v":180},null,null,null,null,null,null,null,null,null,{"$f":"IF(AND(EU75=10,EW75=10),BB76+20+EY75,IF(AND(EU75=10,EW75<10),BB76+10+EW75+EX75,IF(AND(EU75<10,EU75+EV75=10),BB76+10+EW75,BB76+EU75+EV75)))","v":210},null,null,null,null,null,null,null,null,null,{"$f":"IF(AND(EW75=10,EY75=10),BL76+20+FA75,IF(AND(EW75=10,EY75<10),BL76+10+EY75+EZ75,IF(AND(EW75<10,EW75+EX75=10),BL76+10+EY75,BL76+EW75+EX75)))","v":240},null,null,null,null,null,null,null,null,null,{"$f":"IF(AND(EY75=10,FA75=10),BV76+20+FB75,IF(AND(EY75=10,FA75<10),BV76+10+FA75+FB75,IF(AND(EY75<10,EY75+EZ75=10),BV76+10+FA75,BV76+EY75+EZ75)))","v":270},null,null,null,null,null,null,null,null,null,{"$f":"CF76+FA75+FB75+FC75","v":300},null,null,null,null,null,null,null,null,null,null,null,null,null,null,"〈",null,{"$f":"COUNTIF(D82:DS82,\"P\")+COUNTIF(D82:DS82,\"S\")+COUNTIF(D82:DS82,\"C\")","v":0},null,null,null,",",null,{"$f":"COUNTIF(D82:DS82,\"P\")","v":0},null,null,null,",",null,{"$f":"COUNTIF(EI78:FA78,\"1\")","v":10},null,null,null,"〉",null,{"$f":"COUNTIF(D82:DS82,\"H\")","v":0},null,null,null,null,null,null,null,null,null,{"$f":"COUNTIF(D77:M82,\"●\")","v":0},null,{"$f":"COUNTIF(N77:W82,\"●\")","v":0},null,{"$f":"COUNTIF(X77:AG82,\"●\")","v":0},null,{"$f":"COUNTIF(AH77:AQ82,\"●\")","v":0},null,{"$f":"COUNTIF(AR77:BA82,\"●\")","v":0},null,{"$f":"COUNTIF(BB77:BK82,\"●\")","v":0},null,{"$f":"COUNTIF(BL77:BU82,\"●\")","v":0},null,{"$f":"COUNTIF(BV77:CE82,\"●\")","v":0},null,{"$f":"COUNTIF(CF77:CO82,\"●\")","v":0},null,{"$f":"COUNTIF(CP77:CY82,\"●\")","v":0},{"$f":"COUNTIF(CZ77:DI82,\"●\")","v":0},{"$f":"COUNTIF(DJ77:DS82,\"●\")","v":0}]
[]
[null,null,null,null,"・",null,"・",null,"・",null,"・",null,null,null,"・",null,"・",null,"・",null,"・",null,null,null,"・",null,"・",null,"・",null,"・",null,null,null,"・",null,"・",null,"・",null,"・",null,null,null,"・",null,"・",null,"・",null,"・",null,null,null,"・",null,"・",null,"・",null,"・",null,null,null,"・",null,"・",null,"・",null,"・",null,null,null,"・",null,"・",null,"・",null,"・",null,null,null,"・",null,"・",null,"・",null,"・",null,null,null,"・",null,"・",null,"・",null,"・",null,null,null,"・",null,"・",null,"・",null,"・",null,null,null,"・",null,"・",null,"・",null,"・",null,null,null,null,null,null,null,null,null,null,null,null,null,null,null,null,null,{"$f":"IF(AND(EI75=10,EK75=10),\"1\",\"0\")","v":"1"},null,{"$f":"IF(AND(EK75=10,EM75=10),\"1\",\"0\")","v":"1"},null,{"$f":"IF(AND(EM75=10,EO75=10),\"1\",\"0\")","v":"1"},null,{"$f":"IF(AND(EO75=10,EQ75=10),\"1\",\"0\")","v":"1"},null,{"$f":"IF(AND(EQ75=10,ES75=10),\"1\",\"0\")","v":"1"},null,{"$f":"IF(AND(ES75=10,EU75=10),\"1\",\"0\")","v":"1"},null,{"$f":"IF(AND(EU75=10,EW75=10),\"1\",\"0\")","v":"1"},null,{"$f":"IF(AND(EW75=10,EY75=10),\"1\",\"0\")","v":"1"},null,{"$f":"IF(AND(EY75=10,FA75=10),\"1\",\"0\")","v":"1"},null,{"$f":"IF(AND(FA75=10,FB75=10),\"1\",\"0\")","v":"1"}]
[null,null,null,null,null,"・",null,"・",null,"・",null,null,null,null,null,"・",null,"・",null,"・",null,null,null,null,null,"・",null,"・",null,"・",null,null,null,null,null,"・",null,"・",null,"・",null,null,null,null,null,"・",null,"・",null,"・",null,null,null,null,null,"・",null,"・",null,"・",null,null,null,null,null,"・",null,"・",null,"・",null,null,null,null,null,"・",null,"・",null,"・",null,null,null,null,null,"・",null,"・",null,"・",null,null,null,null,null,"・",null,"・",null,"・",null,null,null,null,null,"・",null,"・",null,"・",null,null,null,null,null,"・",null,"・",null,"・",null,null,null,null,null,null,null,null,null,null,null,null,null,null,null,null,null,{"$f":"COUNTIF(D75:DD75,\"/\")","v":0}]
[null,null,null,null,null,null,"・",null,"・",null,null,null,null,null,null,null,"・",null,"・",null,null,null,null,null,null,null,"・",null,"・",null,null,null,null,null,null,null,"・",null,"・",null,null,null,null,null,null,null,"・",null,"・",null,null,null,null,null,null,null,"・",null,"・",null,null,null,null,null,null,null,"・",null,"・",null,null,null,null,null,null,null,"・",null,"・",null,null,null,null,null,null,null,"・",null,"・",null,null,null,null,null,null,null,"・",null,"・",null,null,null,null,null,null,null,"・",null,"・",null,null,null,null,null,null,null,"・",null,"・",null,null,null,null,null,null,null,null,null,null,null,null,null,null,null,null,null,null,{"$f":"COUNTIF(EI80:FA80,\"1\")","v":0},{"$f":"IF(AND(E82=\"1○\",I75=\"/\"),\"1\",\"0\")","v":"0"},null,{"$f":"IF(AND(O82=\"1○\",S75=\"/\"),\"1\",\"0\")","v":"0"},null,{"$f":"IF(AND(Y82=\"1○\",AC75=\"/\"),\"1\",\"0\")","v":"0"},null,{"$f":"IF(AND(AI82=\"1○\",AM75=\"/\"),\"1\",\"0\")","v":"0"},null,{"$f":"IF(AND(AS82=\"1○\",AW75=\"/\"),\"1\",\"0\")","v":"0"},null,{"$f":"IF(AND(BC82=\"1○\",BG75=\"/\"),\"1\",\"0\")","v":"0"},null,{"$f":"IF(AND(BM82=\"1○\",BQ75=\"/\"),\"1\",\"0\")","v":"0"},null,{"$f":"IF(AND(BW82=\"1○\",CA75=\"/\"),\"1\",\"0\")","v":"0"},null,{"$f":"IF(AND(CG82=\"1○\",CK75=\"/\"),\"1\",\"0\")","v":"0"},null,{"$f":"IF(OR(AND(CQ82=\"1○\",CU75=\"/\"),AND(DA82=\"1○\",CZ75=\"/\")),\"1\",\"0\")","v":"0"}]
[null,null,null,null,null,null,null,"・",null,null,null,null,null,null,null,null,null,"・",null,null,null,null,null,null,null,null,null,"・",null,null,null,null,null,null,null,null,null,"・",null,null,null,null,null,null,null,null,null,"・",null,null,null,null,null,null,null,null,null,"・",null,null,null,null,null,null,null,null,null,"・",null,null,null,null,null,null,null,null,null,"・",null,null,null,null,null,null,null,null,null,"・",null,null,null,null,null,null,null,null,null,"・",null,null,null,null,null,null,null,null,null,"・",null,null,null,null,null,null,null,null,null,"・",null,null,null,null,null,null,null,null,null,null,null,null,null,null,null,null,null,null,null,{"$f":"COUNTIF(EI81:FA81,\"1\")","v":0},{"$f":"IF(AND(E82=\"1○\",EI75+EJ75<10),\"1\",\"0\")","v":"0"},null,{"$f":"IF(AND(O82=\"1○\",EK75+EL75<10),\"1\",\"0\")","v":"0"},null,{"$f":"IF(AND(Y82=\"1○\",EM75+EN75<10),\"1\",\"0\")","v":"0"},null,{"$f":"IF(AND(AI82=\"1○\",EO75+EP75<10),\"1\",\"0\")","v":"0"},null,{"$f":"IF(AND(AS82=\"1○\",EQ75+ER75<10),\"1\",\"0\")","v":"0"},null,{"$f":"IF(AND(BC82=\"1○\",ES75+ET75<10),\"1\",\"0\")","v":"0"},null,{"$f":"IF(AND(BM82=\"1○\",EU75+EV75<10),\"1\",\"0\")","v":"0"},null,{"$f":"IF(AND(BW82=\"1○\",EW75+EX75<10),\"1\",\"0\")","v":"0"},null,{"$f":"IF(AND(CG82=\"1○\",EY75+EZ75<10),\"1\",\"0\")","v":"0"},null,{"$f":"IF(OR(AND(CQ82=\"1○\",FA75+FB75<10),AND(DA82=\"1○\",FB75+FC75<10)),\"1\",\"0\")","v":"0"}]
[]
[]
[null,null,"Player 4",1,null,null,null,null,null,null,null,null,null,2,null,null,null,null,null,null,null,null,null,3,null,null,null,null,null,null,null,null,null,4,null,null,null,null,null,null,null,null,null,5,null,null,null,null,null,null,null,null,null,6,null,null,null,null,null,null,null,null,null,7,null,null,null,null,null,null,null,null,null,8,null,null,null,null,null,null,null,null,null,9,null,null,null,null,null,null,null,null,null,10,null,null,null,null,null,null,null,null,null,null,null,null,null,null,null,null,null,null,null,null,null,null,null,null,null,null,null,null,null,null,null,null,null,null,null,null,null,null,null,null,null,null,null,null,1,null,2,null,3,null,4,null,5,null,6,null,7,null,8,null,9,null,10]
[null,null,null,{"$f":"IF(EI85=10,\"X\",IF(AND(EI85=0,OR(E92=\"1F\",E92=\"1,2F\")),\"F\",IF(EI85=0,\"G\",IF(AND(EI85=8,E92=\"1○\"),\"⑧\",IF(AND(EI85=7,E92=\"1○\"),\"⑦\",IF(AND(EI85=6,E92=\"1○\"),\"⑥\",IF(AND(EI85=5,E92=\"1○\"),\"⑤\",IF(AND(EI85=4,E92=\"1○\"),\"④\",EI85))))))))","v":"X"},null,null,null,null,{"$f":"IF(AND(EI85<10,EI85+EJ85=10),\"/\",IF(EI85=10,\"\",IF(OR(AND(EJ85=0,E92=\"2F\"),AND(EJ85=0,E92=\"1,2F\")),\"F\",IF(EJ85=0,\"-\",EJ85))))","v":""},null,null,null,null,{"$f":"IF(EK85=10,\"X\",IF(AND(EK85=0,OR(O92=\"1F\",O92=\"1,2F\")),\"F\",IF(EK85=0,\"G\",IF(AND(EK85=8,O92=\"1○\"),\"⑧\",IF(AND(EK85=7,O92=\"1○\"),\"⑦\",IF(AND(EK85=6,O92=\"1○\"),\"⑥\",IF(AND(EK85=5,O92=\"1○\"),\"⑤\",IF(AND(EK85=4,O92=\"1○\"),\"④\",EK85))))))))","v":"X"},null,null,null,null,{"$f":"IF(AND(EK85<10,EK85+EL85=10),\"/\",IF(EK85=10,\"\",IF(OR(AND(EL85=0,O92=\"2F\"),AND(EL85=0,O92=\"1,2F\")),\"F\",IF(EL85=0,\"-\",EL85))))","v":""},null,null,null,null,{"$f":"IF(EM85=10,\"X\",IF(AND(EM85=0,OR(Y92=\"1F\",Y92=\"1,2F\")),\"F\",IF(EM85=0,\"G\",IF(AND(EM85=8,Y92=\"1○\"),\"⑧\",IF(AND(EM85=7,Y92=\"1○\"),\"⑦\",IF(AND(EM85=6,Y92=\"1○\"),\"⑥\",IF(AND(EM85=5,Y92=\"1○\"),\"⑤\",IF(AND(EM85=4,Y92=\"1○\"),\"④\",EM85))))))))","v":"X"},null,null,null,null,{"$f":"IF(AND(EM85<10,EM85+EN85=10),\"/\",IF(EM85=10,\"\",IF(OR(AND(EN85=0,Y92=\"2F\"),AND(EN85=0,Y92=\"1,2F\")),\"F\",IF(EN85=0,\"-\",EN85))))","v":""},null,null,null,null,{"$f":"IF(EO85=10,\"X\",IF(AND(EO85=0,OR(AI92=\"1F\",AI92=\"1,2F\")),\"F\",IF(EO85=0,\"G\",IF(AND(EO85=8,AI92=\"1○\"),\"⑧\",IF(AND(EO85=7,AI92=\"1○\"),\"⑦\",IF(AND(EO85=6,AI92=\"1○\"),\"⑥\",IF(AND(EO85=5,AI92=\"1○\"),\"⑤\",IF(AND(EO85=4,AI92=\"1○\"),\"④\",EO85))))))))","v":"X"},null,null,null,null,{"$f":"IF(AND(EO85<10,EO85+EP85=10),\"/\",IF(EO85=10,\"\",IF(OR(AND(EP85=0,AI92=\"2F\"),AND(EP85=0,AI92=\"1,2F\")),\"F\",IF(EP85=0,\"-\",EP85))))","v":""},null,null,null,null,{"$f":"IF(EQ85=10,\"X\",IF(AND(EQ85=0,OR(AS92=\"1F\",AS92=\"1,2F\")),\"F\",IF(EQ85=0,\"G\",IF(AND(EQ85=8,AS92=\"1○\"),\"⑧\",IF(AND(EQ85=7,AS92=\"1○\"),\"⑦\",IF(AND(EQ85=6,AS92=\"1○\"),\"⑥\",IF(AND(EQ85=5,AS92=\"1○\"),\"⑤\",IF(AND(EQ85=4,AS92=\"1○\"),\"④\",EQ85))))))))","v":"X"},null,null,null,null,{"$f":"IF(AND(EQ85<10,EQ85+ER85=10),\"/\",IF(EQ85=10,\"\",IF(OR(AND(ER85=0,AS92=\"2F\"),AND(ER85=0,AS92=\"1,2F\")),\"F\",IF(ER85=0,\"-\",ER85))))","v":""},null,null,null,null,{"$f":"IF(ES85=10,\"X\",IF(AND(ES85=0,OR(BC92=\"1F\",BC92=\"1,2F\")),\"F\",IF(ES85=0,\"G\",IF(AND(ES85=8,BC92=\"1○\"),\"⑧\",IF(AND(ES85=7,BC92=\"1○\"),\"⑦\",IF(AND(ES85=6,BC92=\"1○\"),\"⑥\",IF(AND(ES85=5,BC92=\"1○\"),\"⑤\",IF(AND(ES85=4,BC92=\"1○\"),\"④\",ES85))))))))","v":"X"},null,null,null,null,{"$f":"IF(AND(ES85<10,ES85+ET85=10),\"/\",IF(ES85=10,\"\",IF(OR(AND(ET85=0,BC92=\"2F\"),AND(ET85=0,BC92=\"1,2F\")),\"F\",IF(ET85=0,\"-\",ET85))))","v":""},null,null,null,null,{"$f":"IF(EU85=10,\"X\",IF(AND(EU85=0,OR(BM92=\"1F\",BM92=\"1,2F\")),\"F\",IF(EU85=0,\"G\",IF(AND(EU85=8,BM92=\"1○\"),\"⑧\",IF(AND(EU85=7,BM92=\"1○\"),\"⑦\",IF(AND(EU85=6,BM92=\"1○\"),\"⑥\",IF(AND(EU85=5,BM92=\"1○\"),\"⑤\",IF(AND(EU85=4,BM92=\"1○\"),\"④\",EU85))))))))","v":"X"},null,null,null,null,{"$f":"IF(AND(EU85<10,EU85+EV85=10),\"/\",IF(EU85=10,\"\",IF(OR(AND(EV85=0,BM92=\"2F\"),AND(EV85=0,BM92=\"1,2F\")),\"F\",IF(EV85=0,\"-\",EV85))))","v":""},null,null,null,null,{"$f":"IF(EW85=10,\"X\",IF(AND(EW85=0,OR(BW92=\"1F\",BW92=\"1,2F\")),\"F\",IF(EW85=0,\"G\",IF(AND(EW85=8,BW92=\"1○\"),\"⑧\",IF(AND(EW85=7,BW92=\"1○\"),\"⑦\",IF(AND(EW85=6,BW92=\"1○\"),\"⑥\",IF(AND(EW85=5,BW92=\"1○\"),\"⑤\",IF(AND(EW85=4,BW92=\"1○\"),\"④\",EW85))))))))","v":"X"},null,null,null,null,{"$f":"IF(AND(EW85<10,EW85+EX85=10),\"/\",IF(EW85=10,\"\",IF(OR(AND(EX85=0,BW92=\"2F\"),AND(EX85=0,BW92=\"1,2F\")),\"F\",IF(EX85=0,\"-\",EX85))))","v":""},null,null,null,null,{"$f":"IF(EY85=10,\"X\",IF(AND(EY85=0,OR(CG92=\"1F\",CG92=\"1,2F\")),\"F\",IF(EY85=0,\"G\",IF(AND(EY85=8,CG92=\"1○\"),\"⑧\",IF(AND(EY85=7,CG92=\"1○\"),\"⑦\",IF(AND(EY85=6,CG92=\"1○\"),\"⑥\",IF(AND(EY85=5,CG92=\"1○\"),\"⑤\",IF(AND(EY85=4,CG92=\"1○\"),\"④\",EY85))))))))","v":"X"},null,null,null,null,{"$f":"IF(AND(EY85<10,EY85+EZ85=10),\"/\",IF(EY85=10,\"\",IF(OR(AND(EZ85=0,CG92=\"2F\"),AND(EZ85=0,CG92=\"1,2F\")),\"F\",IF(EZ85=0,\"-\",EZ85))))","v":""},null,null,null,null,{"$f":"IF(FA85=10,\"X\",IF(AND(FA85=0,OR(CQ92=\"1F\",CQ92=\"1,2F\")),\"F\",IF(FA85=0,\"G\",IF(AND(FA85=8,CQ92=\"1○\"),\"⑧\",IF(AND(FA85=7,CQ92=\"1○\"),\"⑦\",IF(AND(FA85=6,CQ92=\"1○\"),\"⑥\",IF(AND(FA85=5,CQ92=\"1○\"),\"⑤\",IF(AND(FA85=4,CQ92=\"1○\"),\"④\",FA85))))))))","v":"X"},null,null,null,null,{"$f":"IF(AND(FA85=10,FB85=10),\"X\",IF(AND(FA85<10,FA85+FB85=10),\"/\",IF(OR(AND(FA85=10,FB85=0,DA92=\"1F\"),AND(FA85=10,FB85=0,DA92=\"1,2F\")),\"F\",IF(AND(FA85=10,FB85=0),\"G\",IF(AND(FA85=10,FB85=8,DA92=\"1○\"),\"⑧\",IF(AND(FA85=10,FB85=7,DA92=\"1○\"),\"⑦\",IF(AND(FA85=10,FB85=6,DA92=\"1○\"),\"⑥\",IF(AND(FA85=10,FB85=5,DA92=\"1○\"),\"⑤\",IF(AND(FA85=10,FB85=4,DA92=\"1○\"),\"④\",IF(AND(FA85=10,FB85<10),FB85,IF(OR(AND(FA85<10,FB85=0,CQ92=\"2F\"),AND(FA85<10,FB85=0,CQ92=\"1,2F\")),\"F\",IF(AND(FA85<10,FB85=0),\"-\",FB85))))))))))))","v":"X"},null,null,null,null,{"$f":"IF(FC85=10,\"X\",IF(OR(AND(FB85=10,FC85=8,DK92=\"1○\"),AND(FA85+FB85=10,FC85=8,DA92=\"1○\")),\"⑧\",IF(OR(AND(FB85=10,FC85=7,DK92=\"1○\"),AND(FA85+FB85=10,FC85=7,DA92=\"1○\")),\"⑦\",IF(OR(AND(FB85=10,FC85=6,DK92=\"1○\"),AND(FA85+FB85=10,FC85=6,DA92=\"1○\")),\"⑥\",IF(OR(AND(FB85=10,FC85=5,DK92=\"1○\"),AND(FA85+FB85=10,FC85=5,DA92=\"1○\")),\"⑤\",IF(OR(AND(FB85=10,FC85=4,DK92=\"1○\"),AND(FA85+FB85=10,FC85=4,DA92=\"1○\")),\"④\",IF(OR(AND(FB85=10,FC85=0,DK92=\"1F\"),AND(FB85<10,FC85=0,DA92=\"2F\"),AND(FB85<10,FC85=0,DA92=\"1,2F\")),\"F\",IF(AND(FA85=10,FB85<10,FB85+FC85=10),\"/\",IF(AND(OR(FB85=10,AND(FA85+FB85=10,FA85<10)),FC85=0),\"G\",IF(AND(FA85=10,FB85<10,FC85=0),\"-\",IF(FA85+FB85<10,\"\",FC85)))))))))))","v":"X"},null,null,null,null,"(",null,{"$f":"EH89-EH90","v":0},null,null,null,",",null,{"$f":"IF(FB86=0,(DG85+DS85)-EH91,(DG85+DS85+1)-EH91)","v":0},null,null,null,")",null,{"$f":"COUNTIF(EI86:FA86,\">0\")","v":0},null,null,null,null,null,null,null,null,null,null,null,null,null,null,null,{"$f":"COUNTIF(D87:M92,\"・\")","v":10},{"$f":"COUNTIF(D87:M92,\"○\")","v":0},{"$f":"COUNTIF(N87:W92,\"・\")","v":10},{"$f":"COUNTIF(N87:W92,\"○\")","v":0},{"$f":"COUNTIF(X87:AG92,\"・\")","v":10},{"$f":"COUNTIF(X87:AG92,\"○\")","v":0},{"$f":"COUNTIF(AH87:AQ92,\"・\")","v":10},{"$f":"COUNTIF(AH87:AQ92,\"○\")","v":0},{"$f":"COUNTIF(AR87:BA92,\"・\")","v":10},{"$f":"COUNTIF(AR87:BA92,\"○\")","v":0},{"$f":"COUNTIF(BB87:BK92,\"・\")","v":10},{"$f":"COUNTIF(BB87:BK92,\"○\")","v":0},{"$f":"COUNTIF(BL87:BU92,\"・\")","v":10},{"$f":"COUNTIF(BL87:BU92,\"○\")","v":0},{"$f":"COUNTIF(BV87:CE92,\"・\")","v":10},{"$f":"COUNTIF(BV87:CE92,\"○\")","v":0},{"$f":"COUNTIF(CF87:CO92,\"・\")","v":10},{"$f":"COUNTIF(CF87:CO92,\"○\")","v":0},{"$f":"COUNTIF(CP87:CY92,\"・\")","v":10},{"$f":"IF(FA85=10,COUNTIF(CZ87:DI92,\"・\"),COUNTIF(CP87:CY92,\"○\"))","v":10},{"$f":"IF(AND(FA85=10,FB85=10),COUNTIF(DJ87:DS92,\"・\"),IF(AND(FA85=10,FB85<10),COUNTIF(CZ87:DI92,\"○\"),IF(AND(FA85<10,FA85+FB85=10),COUNTIF(CZ87:DI92,\"・\"),\"0\")))","v":10}]
[null,null,null,{"$f":"IF(AND(EI85=10,EK85=10),20+EM85,IF(AND(EI85=10,EK85<10),10+EK85+EL85,IF(AND(EI85<10,EI85+EJ85=10),10+EK85,EI85+EJ85)))","v":30},null,null,null,null,null,null,null,null,null,{"$f":"IF(AND(EK85=10,EM85=10),D86+20+EO85,IF(AND(EK85=10,EM85<10),D86+10+EM85+EN85,IF(AND(EK85<10,EK85+EL85=10),D86+10+EM85,D86+EK85+EL85)))","v":60},null,null,null,null,null,null,null,null,null,{"$f":"IF(AND(EM85=10,EO85=10),N86+20+EQ85,IF(AND(EM85=10,EO85<10),N86+10+EO85+EP85,IF(AND(EM85<10,EM85+EN85=10),N86+10+EO85,N86+EM85+EN85)))","v":90},null,null,null,null,null,null,null,null,null,{"$f":"IF(AND(EO85=10,EQ85=10),X86+20+ES85,IF(AND(EO85=10,EQ85<10),X86+10+EQ85+ER85,IF(AND(EO85<10,EO85+EP85=10),X86+10+EQ85,X86+EO85+EP85)))","v":120},null,null,null,null,null,null,null,null,null,{"$f":"IF(AND(EQ85=10,ES85=10),AH86+20+EU85,IF(AND(EQ85=10,ES85<10),AH86+10+ES85+ET85,IF(AND(EQ85<10,EQ85+ER85=10),AH86+10+ES85,AH86+EQ85+ER85)))","v":150},null,null,null,null,null,null,null,null,null,{"$f":"IF(AND(ES85=10,EU85=10),AR86+20+EW85,IF(AND(ES85=10,EU85<10),AR86+10+EU85+EV85,IF(AND(ES85<10,ES85+ET85=10),AR86+10+EU85,AR86+ES85+ET85)))","v":180},null,null,null,null,null,null,null,null,null,{"$f":"IF(AND(EU85=10,EW85=10),BB86+20+EY85,IF(AND(EU85=10,EW85<10),BB86+10+EW85+EX85,IF(AND(EU85<10,EU85+EV85=10),BB86+10+EW85,BB86+EU85+EV85)))","v":210},null,null,null,null,null,null,null,null,null,{"$f":"IF(AND(EW85=10,EY85=10),BL86+20+FA85,IF(AND(EW85=10,EY85<10),BL86+10+EY85+EZ85,IF(AND(EW85<10,EW85+EX85=10),BL86+10+EY85,BL86+EW85+EX85)))","v":240},null,null,null,null,null,null,null,null,null,{"$f":"IF(AND(EY85=10,FA85=10),BV86+20+FB85,IF(AND(EY85=10,FA85<10),BV86+10+FA85+FB85,IF(AND(EY85<10,EY85+EZ85=10),BV86+10+FA85,BV86+EY85+EZ85)))","v":270},null,null,null,null,null,null,null,null,null,{"$f":"CF86+FA85+FB85+FC85","v":300},null,null,null,null,null,null,null,null,null,null,null,null,null,null,"〈",null,{"$f":"COUNTIF(D92:DS92,\"P\")+COUNTIF(D92:DS92,\"S\")+COUNTIF(D92:DS92,\"C\")","v":0},null,null,null,",",null,{"$f":"COUNTIF(D92:DS92,\"P\")","v":0},null,null,null,",",null,{"$f":"COUNTIF(EI88:FA88,\"1\")","v":10},null,null,null,"〉",null,{"$f":"COUNTIF(D92:DS92,\"H\")","v":0},null,null,null,null,null,null,null,null,null,{"$f":"COUNTIF(D87:M92,\"●\")","v":0},null,{"$f":"COUNTIF(N87:W92,\"●\")","v":0},null,{"$f":"COUNTIF(X87:AG92,\"●\")","v":0},null,{"$f":"COUNTIF(AH87:AQ92,\"●\")","v":0},null,{"$f":"COUNTIF(AR87:BA92,\"●\")","v":0},null,{"$f":"COUNTIF(BB87:BK92,\"●\")","v":0},null,{"$f":"COUNTIF(BL87:BU92,\"●\")","v":0},null,{"$f":"COUNTIF(BV87:CE92,\"●\")","v":0},null,{"$f":"COUNTIF(CF87:CO92,\"●\")","v":0},null,{"$f":"COUNTIF(CP87:CY92,\"●\")","v":0},{"$f":"COUNTIF(CZ87:DI92,\"●\")","v":0},{"$f":"COUNTIF(DJ87:DS92,\"●\")","v":0}]
[]
[null,null,null,null,"・",null,"・",null,"・",null,"・",null,null,null,"・",null,"・",null,"・",null,"・",null,null,null,"・",null,"・",null,"・",null,"・",null,null,null,"・",null,"・",null,"・",null,"・",null,null,null,"・",null,"・",null,"・",null,"・",null,null,null,"・",null,"・",null,"・",null,"・",null,null,null,"・",null,"・",null,"・",null,"・",null,null,null,"・",null,"・",null,"・",null,"・",null,null,null,"・",null,"・",null,"・",null,"・",null,null,null,"・",null,"・",null,"・",null,"・",null,null,null,"・",null,"・",null,"・",null,"・",null,null,null,"・",null,"・",null,"・",null,"・",null,null,null,null,null,null,null,null,null,null,null,null,null,null,null,null,null,{"$f":"IF(AND(EI85=10,EK85=10),\"1\",\"0\")","v":"1"},null,{"$f":"IF(AND(EK85=10,EM85=10),\"1\",\"0\")","v":"1"},null,{"$f":"IF(AND(EM85=10,EO85=10),\"1\",\"0\")","v":"1"},null,{"$f":"IF(AND(EO85=10,EQ85=10),\"1\",\"0\")","v":"1"},null,{"$f":"IF(AND(EQ85=10,ES85=10),\"1\",\"0\")","v":"1"},null,{"$f":"IF(AND(ES85=10,EU85=10),\"1\",\"0\")","v":"1"},null,{"$f":"IF(AND(EU85=10,EW85=10),\"1\",\"0\")","v":"1"},null,{"$f":"IF(AND(EW85=10,EY85=10),\"1\",\"0\")","v":"1"},null,{"$f":"IF(AND(EY85=10,FA85=10),\"1\",\"0\")","v":"1"},null,{"$f":"IF(AND(FA85=10,FB85=10),\"1\",\"0\")","v":"1"}]
[null,null,null,null,null,"・",null,"・",null,"・",null,null,null,null,null,"・",null,"・",null,"・",null,null,null,null,null,"・",null,"・",null,"・",null,null,null,null,null,"・",null,"・",null,"・",null,null,null,null,null,"・",null,"・",null,"・",null,null,null,null,null,"・",null,"・",null,"・",null,null,null,null,null,"・",null,"・",null,"・",null,null,null,null,null,"・",null,"・",null,"・",null,null,null,null,null,"・",null,"・",null,"・",null,null,null,null,null,"・",null,"・",null,"・",null,null,null,null,null,"・",null,"・",null,"・",null,null,null,null,null,"・",null,"・",null,"・",null,null,null,null,null,null,null,null,null,null,null,null,null,null,null,null,null,{"$f":"COUNTIF(D85:DD85,\"/\")","v":0}]
[null,null,null,null,null,null,"・",null,"・",null,null,null,null,null,null,null,"・",null,"・",null,null,null,null,null,null,null,"・",null,"・",null,null,null,null,null,null,null,"・",null,"・",null,null,null,null,null,null,null,"・",null,"・",null,null,null,null,null,null,null,"・",null,"・",null,null,null,null,null,null,null,"・",null,"・",null,null,null,null,null,null,null,"・",null,"・",null,null,null,null,null,null,null,"・",null,"・",null,null,null,null,null,null,null,"・",null,"・",null,null,null,null,null,null,null,"・",null,"・",null,null,null,null,null,null,null,"・",null,"・",null,null,null,null,null,null,null,null,null,null,null,null,null,null,null,null,null,null,{"$f":"COUNTIF(EI90:FA90,\"1\")","v":0},{"$f":"IF(AND(E92=\"1○\",I85=\"/\"),\"1\",\"0\")","v":"0"},null,{"$f":"IF(AND(O92=\"1○\",S85=\"/\"),\"1\",\"0\")","v":"0"},null,{"$f":"IF(AND(Y92=\"1○\",AC85=\"/\"),\"1\",\"0\")","v":"0"},null,{"$f":"IF(AND(AI92=\"1○\",AM85=\"/\"),\"1\",\"0\")","v":"0"},null,{"$f":"IF(AND(AS92=\"1○\",AW85=\"/\"),\"1\",\"0\")","v":"0"},null,{"$f":"IF(AND(BC92=\"1○\",BG85=\"/\"),\"1\",\"0\")","v":"0"},null,{"$f":"IF(AND(BM92=\"1○\",BQ85=\"/\"),\"1\",\"0\")","v":"0"},null,{"$f":"IF(AND(BW92=\"1○\",CA85=\"/\"),\"1\",\"0\")","v":"0"},null,{"$f":"IF(AND(CG92=\"1○\",CK85=\"/\"),\"1\",\"0\")","v":"0"},null,{"$f":"IF(OR(AND(CQ92=\"1○\",CU85=\"/\"),AND(DA92=\"1○\",CZ85=\"/\")),\"1\",\"0\")","v":"0"}]
[null,null,null,null,null,null,null,"・",null,null,null,null,null,null,null,null,null,"・",null,null,null,null,null,null,null,null,null,"・",null,null,null,null,null,null,null,null,null,"・",null,null,null,null,null,null,null,null,null,"・",null,null,null,null,null,null,null,null,null,"・",null,null,null,null,null,null,null,null,null,"・",null,null,null,null,null,null,null,null,null,"・",null,null,null,null,null,null,null,null,null,"・",null,null,null,null,null,null,null,null,null,"・",null,null,null,null,null,null,null,null,null,"・",null,null,null,null,null,null,null,null,null,"・",null,null,null,null,null,null,null,null,null,null,null,null,null,null,null,null,null,null,null,{"$f":"COUNTIF(EI91:FA91,\"1\")","v":0},{"$f":"IF(AND(E92=\"1○\",EI85+EJ85<10),\"1\",\"0\")","v":"0"},null,{"$f":"IF(AND(O92=\"1○\",EK85+EL85<10),\"1\",\"0\")","v":"0"},null,{"$f":"IF(AND(Y92=\"1○\",EM85+EN85<10),\"1\",\"0\")","v":"0"},null,{"$f":"IF(AND(AI92=\"1○\",EO85+EP85<10),\"1\",\"0\")","v":"0"},null,{"$f":"IF(AND(AS92=\"1○\",EQ85+ER85<10),\"1\",\"0\")","v":"0"},null,{"$f":"IF(AND(BC92=\"1○\",ES85+ET85<10),\"1\",\"0\")","v":"0"},null,{"$f":"IF(AND(BM92=\"1○\",EU85+EV85<10),\"1\",\"0\")","v":"0"},null,{"$f":"IF(AND(BW92=\"1○\",EW85+EX85<10),\"1\",\"0\")","v":"0"},null,{"$f":"IF(AND(CG92=\"1○\",EY85+EZ85<10),\"1\",\"0\")","v":"0"},null,{"$f":"IF(OR(AND(CQ92=\"1○\",FA85+FB85<10),AND(DA92=\"1○\",FB85+FC85<10)),\"1\",\"0\")","v":"0"}]
[]
[]
[null,null,"Player 5",1,null,null,null,null,null,null,null,null,null,2,null,null,null,null,null,null,null,null,null,3,null,null,null,null,null,null,null,null,null,4,null,null,null,null,null,null,null,null,null,5,null,null,null,null,null,null,null,null,null,6,null,null,null,null,null,null,null,null,null,7,null,null,null,null,null,null,null,null,null,8,null,null,null,null,null,null,null,null,null,9,null,null,null,null,null,null,null,null,null,10,null,null,null,null,null,null,null,null,null,null,null,null,null,null,null,null,null,null,null,null,null,null,null,null,null,null,null,null,null,null,null,null,null,null,null,null,null,null,null,null,null,null,null,null,1,null,2,null,3,null,4,null,5,null,6,null,7,null,8,null,9,null,10]
[null,null,null,{"$f":"IF(EI95=10,\"X\",IF(AND(EI95=0,OR(E102=\"1F\",E102=\"1,2F\")),\"F\",IF(EI95=0,\"G\",IF(AND(EI95=8,E102=\"1○\"),\"⑧\",IF(AND(EI95=7,E102=\"1○\"),\"⑦\",IF(AND(EI95=6,E102=\"1○\"),\"⑥\",IF(AND(EI95=5,E102=\"1○\"),\"⑤\",IF(AND(EI95=4,E102=\"1○\"),\"④\",EI95))))))))","v":"X"},null,null,null,null,{"$f":"IF(AND(EI95<10,EI95+EJ95=10),\"/\",IF(EI95=10,\"\",IF(OR(AND(EJ95=0,E102=\"2F\"),AND(EJ95=0,E102=\"1,2F\")),\"F\",IF(EJ95=0,\"-\",EJ95))))","v":""},null,null,null,null,{"$f":"IF(EK95=10,\"X\",IF(AND(EK95=0,OR(O102=\"1F\",O102=\"1,2F\")),\"F\",IF(EK95=0,\"G\",IF(AND(EK95=8,O102=\"1○\"),\"⑧\",IF(AND(EK95=7,O102=\"1○\"),\"⑦\",IF(AND(EK95=6,O102=\"1○\"),\"⑥\",IF(AND(EK95=5,O102=\"1○\"),\"⑤\",IF(AND(EK95=4,O102=\"1○\"),\"④\",EK95))))))))","v":"X"},null,null,null,null,{"$f":"IF(AND(EK95<10,EK95+EL95=10),\"/\",IF(EK95=10,\"\",IF(OR(AND(EL95=0,O102=\"2F\"),AND(EL95=0,O102=\"1,2F\")),\"F\",IF(EL95=0,\"-\",EL95))))","v":""},null,null,null,null,{"$f":"IF(EM95=10,\"X\",IF(AND(EM95=0,OR(Y102=\"1F\",Y102=\"1,2F\")),\"F\",IF(EM95=0,\"G\",IF(AND(EM95=8,Y102=\"1○\"),\"⑧\",IF(AND(EM95=7,Y102=\"1○\"),\"⑦\",IF(AND(EM95=6,Y102=\"1○\"),\"⑥\",IF(AND(EM95=5,Y102=\"1○\"),\"⑤\",IF(AND(EM95=4,Y102=\"1○\"),\"④\",EM95))))))))","v":"X"},null,null,null,null,{"$f":"IF(AND(EM95<10,EM95+EN95=10),\"/\",IF(EM95=10,\"\",IF(OR(AND(EN95=0,Y102=\"2F\"),AND(EN95=0,Y102=\"1,2F\")),\"F\",IF(EN95=0,\"-\",EN95))))","v":""},null,null,null,null,{"$f":"IF(EO95=10,\"X\",IF(AND(EO95=0,OR(AI102=\"1F\",AI102=\"1,2F\")),\"F\",IF(EO95=0,\"G\",IF(AND(EO95=8,AI102=\"1○\"),\"⑧\",IF(AND(EO95=7,AI102=\"1○\"),\"⑦\",IF(AND(EO95=6,AI102=\"1○\"),\"⑥\",IF(AND(EO95=5,AI102=\"1○\"),\"⑤\",IF(AND(EO95=4,AI102=\"1○\"),\"④\",EO95))))))))","v":"X"},null,null,null,null,{"$f":"IF(AND(EO95<10,EO95+EP95=10),\"/\",IF(EO95=10,\"\",IF(OR(AND(EP95=0,AI102=\"2F\"),AND(EP95=0,AI102=\"1,2F\")),\"F\",IF(EP95=0,\"-\",EP95))))","v":""},null,null,null,null,{"$f":"IF(EQ95=10,\"X\",IF(AND(EQ95=0,OR(AS102=\"1F\",AS102=\"1,2F\")),\"F\",IF(EQ95=0,\"G\",IF(AND(EQ95=8,AS102=\"1○\"),\"⑧\",IF(AND(EQ95=7,AS102=\"1○\"),\"⑦\",IF(AND(EQ95=6,AS102=\"1○\"),\"⑥\",IF(AND(EQ95=5,AS102=\"1○\"),\"⑤\",IF(AND(EQ95=4,AS102=\"1○\"),\"④\",EQ95))))))))","v":"X"},null,null,null,null,{"$f":"IF(AND(EQ95<10,EQ95+ER95=10),\"/\",IF(EQ95=10,\"\",IF(OR(AND(ER95=0,AS102=\"2F\"),AND(ER95=0,AS102=\"1,2F\")),\"F\",IF(ER95=0,\"-\",ER95))))","v":""},null,null,null,null,{"$f":"IF(ES95=10,\"X\",IF(AND(ES95=0,OR(BC102=\"1F\",BC102=\"1,2F\")),\"F\",IF(ES95=0,\"G\",IF(AND(ES95=8,BC102=\"1○\"),\"⑧\",IF(AND(ES95=7,BC102=\"1○\"),\"⑦\",IF(AND(ES95=6,BC102=\"1○\"),\"⑥\",IF(AND(ES95=5,BC102=\"1○\"),\"⑤\",IF(AND(ES95=4,BC102=\"1○\"),\"④\",ES95))))))))","v":"X"},null,null,null,null,{"$f":"IF(AND(ES95<10,ES95+ET95=10),\"/\",IF(ES95=10,\"\",IF(OR(AND(ET95=0,BC102=\"2F\"),AND(ET95=0,BC102=\"1,2F\")),\"F\",IF(ET95=0,\"-\",ET95))))","v":""},null,null,null,null,{"$f":"IF(EU95=10,\"X\",IF(AND(EU95=0,OR(BM102=\"1F\",BM102=\"1,2F\")),\"F\",IF(EU95=0,\"G\",IF(AND(EU95=8,BM102=\"1○\"),\"⑧\",IF(AND(EU95=7,BM102=\"1○\"),\"⑦\",IF(AND(EU95=6,BM102=\"1○\"),\"⑥\",IF(AND(EU95=5,BM102=\"1○\"),\"⑤\",IF(AND(EU95=4,BM102=\"1○\"),\"④\",EU95))))))))","v":"X"},null,null,null,null,{"$f":"IF(AND(EU95<10,EU95+EV95=10),\"/\",IF(EU95=10,\"\",IF(OR(AND(EV95=0,BM102=\"2F\"),AND(EV95=0,BM102=\"1,2F\")),\"F\",IF(EV95=0,\"-\",EV95))))","v":""},null,null,null,null,{"$f":"IF(EW95=10,\"X\",IF(AND(EW95=0,OR(BW102=\"1F\",BW102=\"1,2F\")),\"F\",IF(EW95=0,\"G\",IF(AND(EW95=8,BW102=\"1○\"),\"⑧\",IF(AND(EW95=7,BW102=\"1○\"),\"⑦\",IF(AND(EW95=6,BW102=\"1○\"),\"⑥\",IF(AND(EW95=5,BW102=\"1○\"),\"⑤\",IF(AND(EW95=4,BW102=\"1○\"),\"④\",EW95))))))))","v":"X"},null,null,null,null,{"$f":"IF(AND(EW95<10,EW95+EX95=10),\"/\",IF(EW95=10,\"\",IF(OR(AND(EX95=0,BW102=\"2F\"),AND(EX95=0,BW102=\"1,2F\")),\"F\",IF(EX95=0,\"-\",EX95))))","v":""},null,null,null,null,{"$f":"IF(EY95=10,\"X\",IF(AND(EY95=0,OR(CG102=\"1F\",CG102=\"1,2F\")),\"F\",IF(EY95=0,\"G\",IF(AND(EY95=8,CG102=\"1○\"),\"⑧\",IF(AND(EY95=7,CG102=\"1○\"),\"⑦\",IF(AND(EY95=6,CG102=\"1○\"),\"⑥\",IF(AND(EY95=5,CG102=\"1○\"),\"⑤\",IF(AND(EY95=4,CG102=\"1○\"),\"④\",EY95))))))))","v":"X"},null,null,null,null,{"$f":"IF(AND(EY95<10,EY95+EZ95=10),\"/\",IF(EY95=10,\"\",IF(OR(AND(EZ95=0,CG102=\"2F\"),AND(EZ95=0,CG102=\"1,2F\")),\"F\",IF(EZ95=0,\"-\",EZ95))))","v":""},null,null,null,null,{"$f":"IF(FA95=10,\"X\",IF(AND(FA95=0,OR(CQ102=\"1F\",CQ102=\"1,2F\")),\"F\",IF(FA95=0,\"G\",IF(AND(FA95=8,CQ102=\"1○\"),\"⑧\",IF(AND(FA95=7,CQ102=\"1○\"),\"⑦\",IF(AND(FA95=6,CQ102=\"1○\"),\"⑥\",IF(AND(FA95=5,CQ102=\"1○\"),\"⑤\",IF(AND(FA95=4,CQ102=\"1○\"),\"④\",FA95))))))))","v":"X"},null,null,null,null,{"$f":"IF(AND(FA95=10,FB95=10),\"X\",IF(AND(FA95<10,FA95+FB95=10),\"/\",IF(OR(AND(FA95=10,FB95=0,DA102=\"1F\"),AND(FA95=10,FB95=0,DA102=\"1,2F\")),\"F\",IF(AND(FA95=10,FB95=0),\"G\",IF(AND(FA95=10,FB95=8,DA102=\"1○\"),\"⑧\",IF(AND(FA95=10,FB95=7,DA102=\"1○\"),\"⑦\",IF(AND(FA95=10,FB95=6,DA102=\"1○\"),\"⑥\",IF(AND(FA95=10,FB95=5,DA102=\"1○\"),\"⑤\",IF(AND(FA95=10,FB95=4,DA102=\"1○\"),\"④\",IF(AND(FA95=10,FB95<10),FB95,IF(OR(AND(FA95<10,FB95=0,CQ102=\"2F\"),AND(FA95<10,FB95=0,CQ102=\"1,2F\")),\"F\",IF(AND(FA95<10,FB95=0),\"-\",FB95))))))))))))","v":"X"},null,null,null,null,{"$f":"IF(FC95=10,\"X\",IF(OR(AND(FB95=10,FC95=8,DK102=\"1○\"),AND(FA95+FB95=10,FC95=8,DA102=\"1○\")),\"⑧\",IF(OR(AND(FB95=10,FC95=7,DK102=\"1○\"),AND(FA95+FB95=10,FC95=7,DA102=\"1○\")),\"⑦\",IF(OR(AND(FB95=10,FC95=6,DK102=\"1○\"),AND(FA95+FB95=10,FC95=6,DA102=\"1○\")),\"⑥\",IF(OR(AND(FB95=10,FC95=5,DK102=\"1○\"),AND(FA95+FB95=10,FC95=5,DA102=\"1○\")),\"⑤\",IF(OR(AND(FB95=10,FC95=4,DK102=\"1○\"),AND(FA95+FB95=10,FC95=4,DA102=\"1○\")),\"④\",IF(OR(AND(FB95=10,FC95=0,DK102=\"1F\"),AND(FB95<10,FC95=0,DA102=\"2F\"),AND(FB95<10,FC95=0,DA102=\"1,2F\")),\"F\",IF(AND(FA95=10,FB95<10,FB95+FC95=10),\"/\",IF(AND(OR(FB95=10,AND(FA95+FB95=10,FA95<10)),FC95=0),\"G\",IF(AND(FA95=10,FB95<10,FC95=0),\"-\",IF(FA95+FB95<10,\"\",FC95)))))))))))","v":"X"},null,null,null,null,"(",null,{"$f":"EH99-EH100","v":0},null,null,null,",",null,{"$f":"IF(FB96=0,(DG95+DS95)-EH101,(DG95+DS95+1)-EH101)","v":0},null,null,null,")",null,{"$f":"COUNTIF(EI96:FA96,\">0\")","v":0},null,null,null,null,null,null,null,null,null,null,null,null,null,null,null,{"$f":"COUNTIF(D97:M102,\"・\")","v":10},{"$f":"COUNTIF(D97:M102,\"○\")","v":0},{"$f":"COUNTIF(N97:W102,\"・\")","v":10},{"$f":"COUNTIF(N97:W102,\"○\")","v":0},{"$f":"COUNTIF(X97:AG102,\"・\")","v":10},{"$f":"COUNTIF(X97:AG102,\"○\")","v":0},{"$f":"COUNTIF(AH97:AQ102,\"・\")","v":10},{"$f":"COUNTIF(AH97:AQ102,\"○\")","v":0},{"$f":"COUNTIF(AR97:BA102,\"・\")","v":10},{"$f":"COUNTIF(AR97:BA102,\"○\")","v":0},{"$f":"COUNTIF(BB97:BK102,\"・\")","v":10},{"$f":"COUNTIF(BB97:BK102,\"○\")","v":0},{"$f":"COUNTIF(BL97:BU102,\"・\")","v":10},{"$f":"COUNTIF(BL97:BU102,\"○\")","v":0},{"$f":"COUNTIF(BV97:CE102,\"・\")","v":10},{"$f":"COUNTIF(BV97:CE102,\"○\")","v":0},{"$f":"COUNTIF(CF97:CO102,\"・\")","v":10},{"$f":"COUNTIF(CF97:CO102,\"○\")","v":0},{"$f":"COUNTIF(CP97:CY102,\"・\")","v":10},{"$f":"IF(FA95=10,COUNTIF(CZ97:DI102,\"・\"),COUNTIF(CP97:CY102,\"○\"))","v":10},{"$f":"IF(AND(FA95=10,FB95=10),COUNTIF(DJ97:DS102,\"・\"),IF(AND(FA95=10,FB95<10),COUNTIF(CZ97:DI102,\"○\"),IF(AND(FA95<10,FA95+FB95=10),COUNTIF(CZ97:DI102,\"・\"),\"0\")))","v":10}]
[null,null,null,{"$f":"IF(AND(EI95=10,EK95=10),20+EM95,IF(AND(EI95=10,EK95<10),10+EK95+EL95,IF(AND(EI95<10,EI95+EJ95=10),10+EK95,EI95+EJ95)))","v":30},null,null,null,null,null,null,null,null,null,{"$f":"IF(AND(EK95=10,EM95=10),D96+20+EO95,IF(AND(EK95=10,EM95<10),D96+10+EM95+EN95,IF(AND(EK95<10,EK95+EL95=10),D96+10+EM95,D96+EK95+EL95)))","v":60},null,null,null,null,null,null,null,null,null,{"$f":"IF(AND(EM95=10,EO95=10),N96+20+EQ95,IF(AND(EM95=10,EO95<10),N96+10+EO95+EP95,IF(AND(EM95<10,EM95+EN95=10),N96+10+EO95,N96+EM95+EN95)))","v":90},null,null,null,null,null,null,null,null,null,{"$f":"IF(AND(EO95=10,EQ95=10),X96+20+ES95,IF(AND(EO95=10,EQ95<10),X96+10+EQ95+ER95,IF(AND(EO95<10,EO95+EP95=10),X96+10+EQ95,X96+EO95+EP95)))","v":120},null,null,null,null,null,null,null,null,null,{"$f":"IF(AND(EQ95=10,ES95=10),AH96+20+EU95,IF(AND(EQ95=10,ES95<10),AH96+10+ES95+ET95,IF(AND(EQ95<10,EQ95+ER95=10),AH96+10+ES95,AH96+EQ95+ER95)))","v":150},null,null,null,null,null,null,null,null,null,{"$f":"IF(AND(ES95=10,EU95=10),AR96+20+EW95,IF(AND(ES95=10,EU95<10),AR96+10+EU95+EV95,IF(AND(ES95<10,ES95+ET95=10),AR96+10+EU95,AR96+ES95+ET95)))","v":180},null,null,null,null,null,null,null,null,null,{"$f":"IF(AND(EU95=10,EW95=10),BB96+20+EY95,IF(AND(EU95=10,EW95<10),BB96+10+EW95+EX95,IF(AND(EU95<10,EU95+EV95=10),BB96+10+EW95,BB96+EU95+EV95)))","v":210},null,null,null,null,null,null,null,null,null,{"$f":"IF(AND(EW95=10,EY95=10),BL96+20+FA95,IF(AND(EW95=10,EY95<10),BL96+10+EY95+EZ95,IF(AND(EW95<10,EW95+EX95=10),BL96+10+EY95,BL96+EW95+EX95)))","v":240},null,null,null,null,null,null,null,null,null,{"$f":"IF(AND(EY95=10,FA95=10),BV96+20+FB95,IF(AND(EY95=10,FA95<10),BV96+10+FA95+FB95,IF(AND(EY95<10,EY95+EZ95=10),BV96+10+FA95,BV96+EY95+EZ95)))","v":270},null,null,null,null,null,null,null,null,null,{"$f":"CF96+FA95+FB95+FC95","v":300},null,null,null,null,null,null,null,null,null,null,null,null,null,null,"〈",null,{"$f":"COUNTIF(D102:DS102,\"P\")+COUNTIF(D102:DS102,\"S\")+COUNTIF(D102:DS102,\"C\")","v":0},null,null,null,",",null,{"$f":"COUNTIF(D102:DS102,\"P\")","v":0},null,null,null,",",null,{"$f":"COUNTIF(EI98:FA98,\"1\")","v":10},null,null,null,"〉",null,{"$f":"COUNTIF(D102:DS102,\"H\")","v":0},null,null,null,null,null,null,null,null,null,{"$f":"COUNTIF(D97:M102,\"●\")","v":0},null,{"$f":"COUNTIF(N97:W102,\"●\")","v":0},null,{"$f":"COUNTIF(X97:AG102,\"●\")","v":0},null,{"$f":"COUNTIF(AH97:AQ102,\"●\")","v":0},null,{"$f":"COUNTIF(AR97:BA102,\"●\")","v":0},null,{"$f":"COUNTIF(BB97:BK102,\"●\")","v":0},null,{"$f":"COUNTIF(BL97:BU102,\"●\")","v":0},null,{"$f":"COUNTIF(BV97:CE102,\"●\")","v":0},null,{"$f":"COUNTIF(CF97:CO102,\"●\")","v":0},null,{"$f":"COUNTIF(CP97:CY102,\"●\")","v":0},{"$f":"COUNTIF(CZ97:DI102,\"●\")","v":0},{"$f":"COUNTIF(DJ97:DS102,\"●\")","v":0}]
[null,"Team Total"]
[null,null,null,null,"・",null,"・",null,"・",null,"・",null,null,null,"・",null,"・",null,"・",null,"・",null,null,null,"・",null,"・",null,"・",null,"・",null,null,null,"・",null,"・",null,"・",null,"・",null,null,null,"・",null,"・",null,"・",null,"・",null,null,null,"・",null,"・",null,"・",null,"・",null,null,null,"・",null,"・",null,"・",null,"・",null,null,null,"・",null,"・",null,"・",null,"・",null,null,null,"・",null,"・",null,"・",null,"・",null,null,null,"・",null,"・",null,"・",null,"・",null,null,null,"・",null,"・",null,"・",null,"・",null,null,null,"・",null,"・",null,"・",null,"・",null,null,null,null,null,null,null,null,null,null,null,null,null,null,null,null,null,{"$f":"IF(AND(EI95=10,EK95=10),\"1\",\"0\")","v":"1"},null,{"$f":"IF(AND(EK95=10,EM95=10),\"1\",\"0\")","v":"1"},null,{"$f":"IF(AND(EM95=10,EO95=10),\"1\",\"0\")","v":"1"},null,{"$f":"IF(AND(EO95=10,EQ95=10),\"1\",\"0\")","v":"1"},null,{"$f":"IF(AND(EQ95=10,ES95=10),\"1\",\"0\")","v":"1"},null,{"$f":"IF(AND(ES95=10,EU95=10),\"1\",\"0\")","v":"1"},null,{"$f":"IF(AND(EU95=10,EW95=10),\"1\",\"0\")","v":"1"},null,{"$f":"IF(AND(EW95=10,EY95=10),\"1\",\"0\")","v":"1"},null,{"$f":"IF(AND(EY95=10,FA95=10),\"1\",\"0\")","v":"1"},null,{"$f":"IF(AND(FA95=10,FB95=10),\"1\",\"0\")","v":"1"}]
[null,null,null,null,null,"・",null,"・",null,"・",null,null,null,null,null,"・",null,"・",null,"・",null,null,null,null,null,"・",null,"・",null,"・",null,null,null,null,null,"・",null,"・",null,"・",null,null,null,null,null,"・",null,"・",null,"・",null,null,null,null,null,"・",null,"・",null,"・",null,null,null,null,null,"・",null,"・",null,"・",null,null,null,null,null,"・",null,"・",null,"・",null,null,null,null,null,"・",null,"・",null,"・",null,null,null,null,null,"・",null,"・",null,"・",null,null,null,null,null,"・",null,"・",null,"・",null,null,null,null,null,"・",null,"・",null,"・",null,null,null,null,null,null,null,null,null,null,null,null,null,null,null,null,null,{"$f":"COUNTIF(D95:DD95,\"/\")","v":0}]
[null,{"$f":"CP56+CP66+CP76+CP86+CP96","v":1500},null,null,null,null,"・",null,"・",null,null,null,null,null,null,null,"・",null,"・",null,null,null,null,null,null,null,"・",null,"・",null,null,null,null,null,null,null,"・",null,"・",null,null,null,null,null,null,null,"・",null,"・",null,null,null,null,null,null,null,"・",null,"・",null,null,null,null,null,null,null,"・",null,"・",null,null,null,null,null,null,null,"・",null,"・",null,null,null,null,null,null,null,"・",null,"・",null,null,null,null,null,null,null,"・",null,"・",null,null,null,null,null,null,null,"・",null,"・",null,null,null,null,null,null,null,"・",null,"・",null,null,null,null,null,null,null,null,null,null,null,null,null,null,null,null,null,null,{"$f":"COUNTIF(EI100:FA100,\"1\")","v":0},{"$f":"IF(AND(E102=\"1○\",I95=\"/\"),\"1\",\"0\")","v":"0"},null,{"$f":"IF(AND(O102=\"1○\",S95=\"/\"),\"1\",\"0\")","v":"0"},null,{"$f":"IF(AND(Y102=\"1○\",AC95=\"/\"),\"1\",\"0\")","v":"0"},null,{"$f":"IF(AND(AI102=\"1○\",AM95=\"/\"),\"1\",\"0\")","v":"0"},null,{"$f":"IF(AND(AS102=\"1○\",AW95=\"/\"),\"1\",\"0\")","v":"0"},null,{"$f":"IF(AND(BC102=\"1○\",BG95=\"/\"),\"1\",\"0\")","v":"0"},null,{"$f":"IF(AND(BM102=\"1○\",BQ95=\"/\"),\"1\",\"0\")","v":"0"},null,{"$f":"IF(AND(BW102=\"1○\",CA95=\"/\"),\"1\",\"0\")","v":"0"},null,{"$f":"IF(AND(CG102=\"1○\",CK95=\"/\"),\"1\",\"0\")","v":"0"},null,{"$f":"IF(OR(AND(CQ102=\"1○\",CU95=\"/\"),AND(DA102=\"1○\",CZ95=\"/\")),\"1\",\"0\")","v":"0"}]
[null,null,null,null,null,null,null,"・",null,null,null,null,null,null,null,null,null,"・",null,null,null,null,null,null,null,null,null,"・",null,null,null,null,null,null,null,null,null,"・",null,null,null,null,null,null,null,null,null,"・",null,null,null,null,null,null,null,null,null,"・",null,null,null,null,null,null,null,null,null,"・",null,null,null,null,null,null,null,null,null,"・",null,null,null,null,null,null,null,null,null,"・",null,null,null,null,null,null,null,null,null,"・",null,null,null,null,null,null,null,null,null,"・",null,null,null,null,null,null,null,null,null,"・",null,null,null,null,null,null,null,null,null,null,null,null,null,null,null,null,null,null,null,{"$f":"COUNTIF(EI101:FA101,\"1\")","v":0},{"$f":"IF(AND(E102=\"1○\",EI95+EJ95<10),\"1\",\"0\")","v":"0"},null,{"$f":"IF(AND(O102=\"1○\",EK95+EL95<10),\"1\",\"0\")","v":"0"},null,{"$f":"IF(AND(Y102=\"1○\",EM95+EN95<10),\"1\",\"0\")","v":"0"},null,{"$f":"IF(AND(AI102=\"1○\",EO95+EP95<10),\"1\",\"0\")","v":"0"},null,{"$f":"IF(AND(AS102=\"1○\",EQ95+ER95<10),\"1\",\"0\")","v":"0"},null,{"$f":"IF(AND(BC102=\"1○\",ES95+ET95<10),\"1\",\"0\")","v":"0"},null,{"$f":"IF(AND(BM102=\"1○\",EU95+EV95<10),\"1\",\"0\")","v":"0"},null,{"$f":"IF(AND(BW102=\"1○\",EW95+EX95<10),\"1\",\"0\")","v":"0"},null,{"$f":"IF(AND(CG102=\"1○\",EY95+EZ95<10),\"1\",\"0\")","v":"0"},null,{"$f":"IF(OR(AND(CQ102=\"1○\",FA95+FB95<10),AND(DA102=\"1○\",FB95+FC95<10)),\"1\",\"0\")","v":"0"}]
[]
[]
[]
[]
[]
[]
[null,null,null,null,null,null,null,null,null,null,null,null,null,null,null,null,null,null,null,null,null,null,null,null,null,null,null,null,null,null,null,null,null,null,null,null,null,null,null,null,null,null,null,null,null,null,null,null,null,null,null,null,null,null,null,null,null,null,null,null,null,null,null,null,null,null,null,null,null,null,null,null,null,null,null,null,null,null,null,null,null,null,null,null,null,null,null,null,null,null,null,null,null,null,null,null,null,null,null,null,null,null,null,null,null,null,null,null,null,null,null,null,null,"(C) 2017 Hitoshi Saigo"]

{"sheet":"点差計算","index":1,"n_rows":74,"n_cols":26,"rows_kept":74,"cut":false,"hidden":false,"merged":[[1,13,1,14],[1,15,1,16],[1,17,1,18],[1,19,1,20],[1,21,1,26],[2,3,2,4],[2,5,2,6],[2,7,2,8],[2,9,2,10],[2,11,2,12],[1,3,1,4],[1,5,1,6],[1,7,1,8],[1,9,1,10],[1,11,1,12],[2,25,2,26],[2,13,2,14],[2,15,2,16],[2,17,2,18],[2,19,2,20],[2,21,2,22],[2,23,2,24],[3,21,3,22],[3,23,3,24],[3,25,3,26],[4,3,4,4],[4,5,4,6],[4,7,4,8],[4,9,4,10],[4,11,4,12],[4,13,4,14],[4,15,4,16],[4,17,4,18],[4,19,4,20],[4,21,4,22],[4,23,4,24],[4,25,4,26],[3,3,3,4],[3,5,3,6],[3,7,3,8],[3,9,3,10],[3,11,3,12],[3,13,3,14],[3,15,3,16],[3,17,3,18],[3,19,3,20],[7,1,12,2],[7,3,7,4],[7,5,7,6],[7,7,7,8],[7,9,7,10],[7,11,7,12],[1,1,6,2],[8,3,8,4],[8,5,8,6],[8,7,8,8],[8,9,8,10],[8,11,8,12],[5,25,5,26],[6,3,6,4],[6,5,6,6],[6,7,6,8],[6,9,6,10],[6,11,6,12],[6,13,6,14],[6,15,6,16],[6,17,6,18],[6,19,6,20],[5,13,5,14],[5,15,5,16],[5,17,5,18],[5,19,5,20],[5,21,5,22],[5,23,5,24],[5,3,5,4],[5,5,5,6],[5,7,5,8],[5,9,5,10],[5,11,5,12],[8,13,8,14],[6,21,6,22],[6,23,6,24],[6,25,6,26],[8,15,8,16],[8,17,8,18],[8,19,8,20],[8,21,8,22],[8,23,8,24],[8,25,8,26],[7,15,7,16],[7,17,7,18],[7,19,7,20],[7,21,7,26],[7,13,7,14],[9,15,9,16],[9,17,9,18],[9,19,9,20],[9,21,9,22],[9,23,9,24],[9,25,9,26],[9,3,9,4],[9,5,9,6],[9,7,9,8],[9,9,9,10],[9,11,9,12],[9,13,9,14],[10,15,10,16],[10,17,10,18],[10,19,10,20],[10,21,10,22],[10,23,10,24],[10,25,10,26],[10,3,10,4],[10,5,10,6],[10,7,10,8],[10,9,10,10],[10,11,10,12],[10,13,10,14],[11,15,11,16],[11,17,11,18],[11,19,11,20],[11,21,11,22],[11,23,11,24],[11,25,11,26],[11,3,11,4],[11,5,11,6],[11,7,11,8],[11,9,11,10],[11,11,11,12],[11,13,11,14],[12,15,12,16],[12,17,12,18],[12,19,12,20],[12,21,12,22],[12,23,12,24],[12,25,12,26],[12,3,12,4],[12,5,12,6],[12,7,12,8],[12,9,12,10],[12,11,12,12],[12,13,12,14],[13,13,13,14],[13,15,13,16],[13,17,13,18],[13,19,13,20],[13,21,13,26],[14,3,14,4],[14,5,14,6],[14,7,14,8],[14,9,14,10],[14,11,14,12],[13,3,13,4],[13,5,13,6],[13,7,13,8],[13,9,13,10],[13,11,13,12],[14,25,14,26],[14,13,14,14],[14,15,14,16],[14,17,14,18],[14,19,14,20],[14,21,14,22],[14,23,14,24],[15,21,15,22],[15,23,15,24],[15,25,15,26],[16,3,16,4],[16,5,16,6],[16,7,16,8],[16,9,16,10],[16,11,16,12],[16,13,16,14],[16,15,16,16],[16,17,16,18],[16,19,16,20],[16,21,16,22],[16,23,16,24],[16,25,16,26],[15,3,15,4],[15,5,15,6],[15,7,15,8],[15,9,15,10],[15,11,15,12],[15,13,15,14],[15,15,15,16],[15,17,15,18],[15,19,15,20],[17,3,17,4],[17,5,17,6],[17,7,17,8],[17,9,17,10],[17,11,17,12],[17,25,17,26],[18,3,18,4],[18,5,18,6],[18,7,18,8],[18,9,18,10],[18,11,18,12],[18,13,18,14],[18,15,18,16],[18,17,18,18],[18,19,18,20],[17,13,17,14],[17,15,17,16],[17,17,17,18],[17,19,17,20],[17,21,17,22],[17,23,17,24],[21,2,24,2],[21,24,22,26],[22,3,22,4],[22,5,22,6],[22,7,22,8],[22,9,22,10],[18,21,18,22],[18,23,18,24],[18,25,18,26],[20,3,20,4],[20,5,20,6],[20,7,20,8],[20,9,20,10],[20,11,20,12],[20,13,20,14],[13,1,18,2],[22,11,22,12],[22,13,22,14],[22,15,22,16],[22,17,22,18],[22,19,22,20],[22,21,22,23],[20,15,20,16],[20,17,20,18],[24,3,24,4],[24,5,24,6],[24,7,24,8],[24,9,24,10],[24,11,24,12],[24,13,24,14],[24,15,24,16],[24,17,24,18],[24,19,24,20],[25,11,25,12],[25,13,25,14],[25,15,25,16],[25,17,25,18],[25,19,25,20],[20,19,20,20],[20,21,20,23],[23,22,23,23],[23,24,24,26],[25,21,25,23],[26,2,29,2],[26,24,27,26],[27,3,27,4],[27,5,27,6],[27,7,27,8],[27,9,27,10],[27,11,27,12],[27,13,27,14],[27,15,27,16],[27,17,27,18],[27,19,27,20],[27,21,27,23],[28,22,28,23],[28,24,29,26],[29,3,29,4],[29,5,29,6],[29,7,29,8],[29,9,29,10],[29,11,29,12],[25,3,25,4],[25,5,25,6],[25,7,25,8],[25,9,25,10],[31,2,34,2],[31,24,32,26],[32,3,32,4],[32,5,32,6],[32,7,32,8],[32,9,32,10],[29,13,29,14],[29,15,29,16],[29,17,29,18],[29,19,29,20],[30,3,30,4],[30,5,30,6],[30,7,30,8],[30,9,30,10],[30,11,30,12],[30,13,30,14],[32,11,32,12],[32,13,32,14],[32,15,32,16],[32,17,32,18],[32,19,32,20],[32,21,32,23],[30,15,30,16],[30,17,30,18],[34,3,34,4],[34,5,34,6],[34,7,34,8],[34,9,34,10],[34,11,34,12],[34,13,34,14],[34,15,34,16],[34,17,34,18],[34,19,34,20],[35,11,35,12],[35,13,35,14],[35,15,35,16],[35,17,35,18],[35,19,35,20],[30,19,30,20],[30,21,30,23],[33,22,33,23],[33,24,34,26],[35,21,35,23],[36,2,39,2],[36,24,37,26],[37,3,37,4],[37,5,37,6],[37,7,37,8],[37,9,37,10],[37,11,37,12],[37,13,37,14],[37,15,37,16],[37,17,37,18],[37,19,37,20],[37,21,37,23],[38,22,38,23],[38,24,39,26],[39,3,39,4],[39,5,39,6],[39,7,39,8],[39,9,39,10],[39,11,39,12],[35,3,35,4],[35,5,35,6],[35,7,35,8],[35,9,35,10],[39,13,39,14],[39,15,39,16],[39,17,39,18],[39,19,39,20],[40,3,40,4],[40,5,40,6],[40,7,40,8],[40,9,40,10],[40,11,40,12],[40,13,40,14],[40,15,40,16],[40,17,40,18],[40,19,40,20],[40,21,40,23],[43,22,43,23],[43,24,44,26],[44,3,44,4],[44,5,44,6],[44,7,44,8],[44,9,44,10],[44,11,44,12],[44,13,44,14],[44,15,44,16],[44,17,44,18],[44,19,44,20],[41,24,42,26],[42,3,42,4],[42,5,42,6],[42,7,42,8],[42,9,42,10],[42,11,42,12],[42,13,42,14],[42,15,42,16],[42,17,42,18],[42,19,42,20],[42,21,42,23],[46,1,70,1],[46,3,46,4],[46,5,46,6],[46,7,46,8],[46,9,46,10],[46,11,46,12],[46,13,46,14],[46,15,46,16],[46,17,46,18],[48,15,48,16],[48,17,48,18],[56,3,56,4],[56,5,56,6],[56,7,56,8],[56,9,56,10],[56,11,56,12],[56,13,56,14],[56,15,56,16],[56,17,56,18],[62,2,65,2],[66,3,66,4],[66,5,66,6],[66,7,66,8],[66,9,66,10],[41,2,44,2],[20,1,44,1],[48,21,48,23],[49,22,49,23],[49,24,50,26],[50,15,50,16],[50,17,50,18],[50,19,50,20],[46,19,46,20],[46,21,46,23],[47,2,50,2],[47,24,48,26],[48,3,48,4],[48,5,48,6],[48,7,48,8],[48,9,48,10],[48,11,48,12],[48,13,48,14],[50,3,50,4],[50,5,50,6],[50,7,50,8],[50,9,50,10],[50,11,50,12],[50,13,50,14],[48,19,48,20],[52,2,55,2],[52,24,53,26],[53,3,53,4],[53,5,53,6],[53,7,53,8],[53,9,53,10],[51,3,51,4],[51,5,51,6],[51,7,51,8],[51,9,51,10],[51,11,51,12],[51,13,51,14],[53,11,53,12],[53,13,53,14],[53,15,53,16],[53,17,53,18],[53,19,53,20],[53,21,53,23],[51,15,51,16],[51,17,51,18],[51,19,51,20],[51,21,51,23],[54,22,54,23],[54,24,55,26],[55,3,55,4],[55,5,55,6],[55,7,55,8],[55,9,55,10],[55,11,55,12],[55,13,55,14],[55,15,55,16],[55,17,55,18],[55,19,55,20],[57,2,60,2],[57,24,58,26],[58,3,58,4],[58,5,58,6],[58,7,58,8],[58,9,58,10],[58,11,58,12],[58,13,58,14],[58,15,58,16],[58,17,58,18],[58,19,58,20],[58,21,58,23],[59,22,59,23],[59,24,60,26],[60,3,60,4],[60,5,60,6],[60,7,60,8],[60,9,60,10],[60,11,60,12],[63,13,63,14],[63,15,63,16],[63,17,63,18],[63,19,63,20],[63,21,63,23],[61,15,61,16],[61,17,61,18],[61,19,61,20],[56,19,56,20],[56,21,56,23],[60,13,60,14],[60,15,60,16],[60,17,60,18],[60,19,60,20],[61,3,61,4],[61,5,61,6],[61,7,61,8],[61,9,61,10],[61,11,61,12],[61,13,61,14],[66,19,66,20],[70,3,70,4],[70,5,70,6],[70,7,70,8],[70,9,70,10],[70,11,70,12],[61,21,61,23],[64,22,64,23],[64,24,65,26],[65,3,65,4],[65,5,65,6],[65,7,65,8],[65,9,65,10],[65,11,65,12],[65,13,65,14],[65,15,65,16],[65,17,65,18],[65,19,65,20],[62,24,63,26],[63,3,63,4],[63,5,63,6],[63,7,63,8],[63,9,63,10],[63,11,63,12],[73,22,73,26],[66,21,66,23],[67,2,70,2],[67,24,68,26],[68,3,68,4],[68,5,68,6],[68,7,68,8],[68,9,68,10],[68,11,68,12],[68,13,68,14],[68,15,68,16],[70,13,70,14],[70,15,70,16],[70,17,70,18],[70,19,70,20],[68,17,68,18],[68,19,68,20],[68,21,68,23],[69,22,69,23],[69,24,70,26],[66,11,66,12],[66,13,66,14],[66,15,66,16],[66,17,66,18]]}
[null,"　"]
[null,"点差",null,1,null,2,null,3,null,4,null,5,null,6,null,7,null,8,null,9,null,10]
[null,null,null,{"$f":"D9-D15","v":0},null,{"$f":"F9-F15","v":0},null,{"$f":"H9-H15","v":0},null,{"$f":"J9-J15","v":0},null,{"$f":"L9-L15","v":0},null,{"$f":"N9-N15","v":0},null,{"$f":"P9-P15","v":0},null,{"$f":"R9-R15","v":0},null,{"$f":"T9-T15","v":0},null,{"$f":"V9-V15","v":0},null,{"$f":"X9-X15","v":0},null,{"$f":"Z9-Z15","v":0}]
[null,null,null,{"$f":"D10-D16","v":0},null,0,null,0,null,0,null,0,null,0,null,0,null,0,null,{"$f":"T10-T16","v":0},null,0,null,0,null,0]
[null,null,null,0,null,0,null,0,null,0,null,0,null,0,null,0,null,0,null,0,null,0,null,0,null,0]
[null,null,null,0,null,{"$f":"F12-F18","v":0},null,0,null,0,null,0,null,0,null,0,null,0,null,0,null,0,null,0,null,0]
[null,null,null,0,null,0,null,0,null,0,null,0,null,0,null,0,null,0,null,0,null,0,null,{"$f":"X13-X19","v":0},null,{"$f":"Z13-Z19","v":0}]
[null,"京都大学　",null,1,null,2,null,3,null,4,null,5,null,6,null,7,null,8,null,9,null,10]
[null,null,null,{"$f":"D25","v":0},null,{"$f":"D13+F25","v":10},null,{"$f":"F13+H25","v":60},null,{"$f":"H13+J25","v":110},null,{"$f":"J13+L25","v":160},null,{"$f":"L13+N25","v":210},null,{"$f":"N13+P25","v":260},null,{"$f":"P13+R25","v":310},null,{"$f":"R13+T25","v":360},null,{"$f":"T13+V25","v":410},null,{"$f":"V9+W25","v":420},null,{"$f":"X9+X25","v":420}]
[null,null,null,{"$f":"D25+D30","v":0},null,{"$f":"F9+F30","v":20},null,{"$f":"H9+H30","v":70},null,{"$f":"J9+J30","v":120},null,{"$f":"L9+L30","v":170},null,{"$f":"N9+N30","v":220},null,{"$f":"P9+P30","v":270},null,{"$f":"R9+R30","v":320},null,{"$f":"T9+T30","v":370},null,{"$f":"Z9+V30","v":430},null,{"$f":"V10+W30","v":440},null,{"$f":"X10+X30","v":440}]
[null,null,null,{"$f":"D10+D35","v":0},null,{"$f":"F10+F35","v":30},null,{"$f":"H10+H35","v":80},null,{"$f":"J10+J35","v":130},null,{"$f":"L10+L35","v":180},null,{"$f":"N10+N35","v":230},null,{"$f":"P10+P35","v":280},null,{"$f":"R10+R35","v":330},null,{"$f":"T10+T35","v":380},null,{"$f":"Z10+V35","v":450},null,{"$f":"V11+W35","v":460},null,{"$f":"X11+X35","v":460}]
[null,null,null,{"$f":"D11+D40","v":0},null,{"$f":"F11+F40","v":40},null,{"$f":"H11+H40","v":90},null,{"$f":"J11+J40","v":140},null,{"$f":"L11+L40","v":190},null,{"$f":"N11+N40","v":240},null,{"$f":"P11+P40","v":290},null,{"$f":"R11+R40","v":340},null,{"$f":"T11+T40","v":390},null,{"$f":"Z11+V40","v":470},null,{"$f":"V12+W40","v":480},null,{"$f":"X12+X40","v":480}]
[null,null,null,{"$f":"D12+D45","v":0},null,{"$f":"F12+F45","v":50},null,{"$f":"H12+H45","v":100},null,{"$f":"J12+J45","v":150},null,{"$f":"L12+L45","v":200},null,{"$f":"N12+N45","v":250},null,{"$f":"P12+P45","v":300},null,{"$f":"R12+R45","v":350},null,{"$f":"T12+T45","v":400},null,{"$f":"Z12+V45","v":490},null,{"$f":"V13+W45","v":500},null,{"$f":"X13+X45","v":500}]
[null,"相手大学　",null,1,null,2,null,3,null,4,null,5,null,6,null,7,null,8,null,9,null,10]
[null,null,null,{"$f":"D51","v":0},null,{"$f":"D19+F51","v":10},null,{"$f":"F19+H51","v":60},null,{"$f":"H19+J51","v":110},null,{"$f":"J19+L51","v":160},null,{"$f":"L19+N51","v":210},null,{"$f":"N19+P51","v":260},null,{"$f":"P19+R51","v":310},null,{"$f":"R19+T51","v":360},null,{"$f":"T19+V51","v":410},null,{"$f":"V15+W51","v":420},null,{"$f":"X15+X51","v":420}]
[null,null,null,{"$f":"D15+D56","v":0},null,{"$f":"F15+F56","v":20},null,{"$f":"H15+H56","v":70},null,{"$f":"J15+J56","v":120},null,{"$f":"L15+L56","v":170},null,{"$f":"N15+N56","v":220},null,{"$f":"P15+P56","v":270},null,{"$f":"R15+R56","v":320},null,{"$f":"T15+T56","v":370},null,{"$f":"Z15+V56","v":430},null,{"$f":"V16+W56","v":440},null,{"$f":"X16+X56","v":440}]
[null,null,null,{"$f":"D16+D61","v":0},null,{"$f":"F16+F61","v":30},null,{"$f":"H16+H61","v":80},null,{"$f":"J16+J61","v":130},null,{"$f":"L16+L61","v":180},null,{"$f":"N16+N61","v":230},null,{"$f":"P16+P61","v":280},null,{"$f":"R16+R61","v":330},null,{"$f":"T16+T61","v":380},null,{"$f":"Z16+V61","v":450},null,{"$f":"V17+W61","v":460},null,{"$f":"X17+X61","v":460}]
[null,null,null,{"$f":"D17+D66","v":0},null,{"$f":"F17+F66","v":40},null,{"$f":"H17+H66","v":90},null,{"$f":"J17+J66","v":140},null,{"$f":"L17+L66","v":190},null,{"$f":"N17+N66","v":240},null,{"$f":"P17+P66","v":290},null,{"$f":"R17+R66","v":340},null,{"$f":"T17+T66","v":390},null,{"$f":"Z17+V66","v":470},null,{"$f":"V18+W66","v":480},null,{"$f":"X18+X66","v":480}]
[null,null,null,{"$f":"D18+D71","v":0},null,{"$f":"F18+F71","v":50},null,{"$f":"H18+H71","v":100},null,{"$f":"J18+J71","v":150},null,{"$f":"L18+L71","v":200},null,{"$f":"N18+N71","v":250},null,{"$f":"P18+P71","v":300},null,{"$f":"R18+R71","v":350},null,{"$f":"T18+T71","v":400},null,{"$f":"Z18+V71","v":490},null,{"$f":"V19+W71","v":500},null,{"$f":"X19+X71","v":500}]
[]
[null,"京　都　大　学","Player 1",1,null,2,null,3,null,4,null,5,null,6,null,7,null,8,null,9,null,10]
[null,null,{"$f":"スコア!C5","v":0},{"$f":"スコア!EI5","v":10},{"$f":"スコア!EJ5","v":0},{"$f":"スコア!EK5","v":10},{"$f":"スコア!EL5","v":0},{"$f":"スコア!EM5","v":10},{"$f":"スコア!EN5","v":0},{"$f":"スコア!EO5","v":10},{"$f":"スコア!EP5","v":0},{"$f":"スコア!EQ5","v":10},{"$f":"スコア!ER5","v":0},{"$f":"スコア!ES5","v":10},{"$f":"スコア!ET5","v":0},{"$f":"スコア!EU5","v":10},{"$f":"スコア!EV5","v":0},{"$f":"スコア!EW5","v":10},{"$f":"スコア!EX5","v":0},{"$f":"スコア!EY5","v":10},{"$f":"スコア!EZ5","v":0},{"$f":"スコア!FA5","v":10},{"$f":"スコア!FB5","v":10},{"$f":"スコア!FC5","v":10},{"$f":"V23","v":300}]
[null,null,null,{"$f":"IF(AND(D22=10,F22=10),20+H22,IF(AND(D22=10,F22<10),10+F22+G22,IF(AND(D22<10,D22+E22=10),10+F22,D22+E22)))","v":30},null,{"$f":"IF(AND(F22=10,H22=10),D23+20+J22,IF(AND(F22=10,H22<10),D23+10+H22+I22,IF(AND(F22<10,F22+G22=10),D23+10+H22,D23+F22+G22)))","v":60},null,{"$f":"IF(AND(H22=10,J22=10),F23+20+L22,IF(AND(H22=10,J22<10),F23+10+J22+K22,IF(AND(H22<10,H22+I22=10),F23+10+J22,F23+H22+I22)))","v":90},null,{"$f":"IF(AND(J22=10,L22=10),H23+20+N22,IF(AND(J22=10,L22<10),H23+10+L22+M22,IF(AND(J22<10,J22+K22=10),H23+10+L22,H23+J22+K22)))","v":120},null,{"$f":"IF(AND(L22=10,N22=10),J23+20+P22,IF(AND(L22=10,N22<10),J23+10+N22+O22,IF(AND(L22<10,L22+M22=10),J23+10+N22,J23+L22+M22)))","v":150},null,{"$f":"IF(AND(N22=10,P22=10),L23+20+R22,IF(AND(N22=10,P22<10),L23+10+P22+Q22,IF(AND(N22<10,N22+O22=10),L23+10+P22,L23+N22+O22)))","v":180},null,{"$f":"IF(AND(P22=10,R22=10),N23+20+T22,IF(AND(P22=10,R22<10),N23+10+R22+S22,IF(AND(P22<10,P22+Q22=10),N23+10+R22,N23+P22+Q22)))","v":210},null,{"$f":"IF(AND(R22=10,T22=10),P23+20+V22,IF(AND(R22=10,T22<10),P23+10+T22+U22,IF(AND(R22<10,R22+S22=10),P23+10+T22,P23+R22+S22)))","v":240},null,{"$f":"IF(AND(T22=10,V22=10),R23+20+W22,IF(AND(T22=10,V22<10),R23+10+V22+W22,IF(AND(T22<10,T22+U22=10),R23+10+V22,R23+T22+U22)))","v":270},null,{"$f":"T23+V22+W22+X22","v":300}]
[null,null,null,0,{"$f":"IF(D22+E22<10,D22+E22-20,0)","v":0},{"$f":"IF(AND(D22=10,F22=10),10,IF(AND(D22=10,F22+G22<11),F22+G22-10,IF(D22+E22=10,F22-10,0)))","v":10},{"$f":"IF(F22+G22<10,F22+G22-20,0)","v":0},{"$f":"IF(AND(F22=10,H22=10),10,IF(AND(D22=10,F22=10,H22<10),2*H22+I22-20,IF(AND(F22=10,H22+I22<11),H22+I22-10,IF(F22+G22=10,H22-10,0))))","v":10},{"$f":"IF(H22+I22<10,H22+I22-20,0)","v":0},{"$f":"IF(AND(H22=10,J22=10),10,IF(AND(F22=10,H22=10,J22<10),2*J22+K22-20,IF(AND(H22=10,J22+K22<11),J22+K22-10,IF(H22+I22=10,J22-10,0))))","v":10},{"$f":"IF(J22+K22<10,J22+K22-20,0)","v":0},{"$f":"IF(AND(J22=10,L22=10),10,IF(AND(H22=10,J22=10,L22<10),2*L22+M22-20,IF(AND(J22=10,L22+M22<11),L22+M22-10,IF(J22+K22=10,L22-10,0))))","v":10},{"$f":"IF(L22+M22<10,L22+M22-20,0)","v":0},{"$f":"IF(AND(L22=10,N22=10),10,IF(AND(J22=10,L22=10,N22<10),2*N22+O22-20,IF(AND(L22=10,N22+O22<11),N22+O22-10,IF(L22+M22=10,N22-10,0))))","v":10},{"$f":"IF(N22+O22<10,N22+O22-20,0)","v":0},{"$f":"IF(AND(N22=10,P22=10),10,IF(AND(L22=10,N22=10,P22<10),2*P22+Q22-20,IF(AND(N22=10,P22+Q22<11),P22+Q22-10,IF(N22+O22=10,P22-10,0))))","v":10},{"$f":"IF(P22+Q22<10,P22+Q22-20,0)","v":0},{"$f":"IF(AND(P22=10,R22=10),10,IF(AND(N22=10,P22=10,R22<10),2*R22+S22-20,IF(AND(P22=10,R22+S22<11),R22+S22-10,IF(P22+Q22=10,R22-10,0))))","v":10},{"$f":"IF(R22+S22<10,R22+S22-20,0)","v":0},{"$f":"IF(AND(R22=10,T22=10),10,IF(AND(P22=10,R22=10,T22<10),2*T22+U22-20,IF(AND(R22=10,T22+U22<11),T22+U22-10,IF(R22+S22=10,T22-10,0))))","v":10},{"$f":"IF(T22+U22<10,T22+U22-20,0)","v":0},{"$f":"IF(AND(T22=10,V22=10),W22,IF(AND(R22=10,T22=10,V22<10),2*V22+W22-20,IF(AND(T22=10,V22<10),V22+W22-10,IF(T22+U22=10,V22-10,0))))","v":10},{"$f":"V22+W22+X22-20","v":10},null,{"$f":"200+SUM(D25:X25)","v":300}]
[null,null,null,{"$f":"D24+E24","v":0},null,{"$f":"F24+G24","v":10},null,{"$f":"H24+I24","v":10},null,{"$f":"J24+K24","v":10},null,{"$f":"L24+M24","v":10},null,{"$f":"N24+O24","v":10},null,{"$f":"P24+Q24","v":10},null,{"$f":"R24+S24","v":10},null,{"$f":"T24+U24","v":10},null,{"$f":"IF(AND(R22=10,T22=10),IF(V22=10,10,V22-10),IF(T22=10,IF(V22=10,10,0),IF(T22+U22=10,IF(V22=10,0,V22-10),0)))","v":10},{"$f":"IF(W22=10,10,IF(AND(T22=10,V22=10),W22-10,IF(AND(T22=10,V22<10),IF(V22+W22=10,0,2*V22+2*W22-30),IF(V22=10,0,IF(AND(V22<10,V22+W22=10),0,V22+W22-20)))))","v":10},{"$f":"IF(OR(V22+W22=10,V22+W22=20),X22-10,IF(V22=10,W22+X22-10,0))","v":0}]
[null,null,"Player 2",1,null,2,null,3,null,4,null,5,null,6,null,7,null,8,null,9,null,10]
[null,null,{"$f":"スコア!C15","v":0},{"$f":"スコア!EI15","v":10},{"$f":"スコア!EJ15","v":0},{"$f":"スコア!EK15","v":10},{"$f":"スコア!EL15","v":0},{"$f":"スコア!EM15","v":10},{"$f":"スコア!EN15","v":0},{"$f":"スコア!EO15","v":10},{"$f":"スコア!EP15","v":0},{"$f":"スコア!EQ15","v":10},{"$f":"スコア!ER15","v":0},{"$f":"スコア!ES15","v":10},{"$f":"スコア!ET15","v":0},{"$f":"スコア!EU15","v":10},{"$f":"スコア!EV15","v":0},{"$f":"スコア!EW15","v":10},{"$f":"スコア!EX15","v":0},{"$f":"スコア!EY15","v":10},{"$f":"スコア!EZ15","v":0},{"$f":"スコア!FA15","v":10},{"$f":"スコア!FB15","v":10},{"$f":"スコア!FC15","v":10},{"$f":"V28","v":300}]
[null,null,null,{"$f":"IF(AND(D27=10,F27=10),20+H27,IF(AND(D27=10,F27<10),10+F27+G27,IF(AND(D27<10,D27+E27=10),10+F27,D27+E27)))","v":30},null,{"$f":"IF(AND(F27=10,H27=10),D28+20+J27,IF(AND(F27=10,H27<10),D28+10+H27+I27,IF(AND(F27<10,F27+G27=10),D28+10+H27,D28+F27+G27)))","v":60},null,{"$f":"IF(AND(H27=10,J27=10),F28+20+L27,IF(AND(H27=10,J27<10),F28+10+J27+K27,IF(AND(H27<10,H27+I27=10),F28+10+J27,F28+H27+I27)))","v":90},null,{"$f":"IF(AND(J27=10,L27=10),H28+20+N27,IF(AND(J27=10,L27<10),H28+10+L27+M27,IF(AND(J27<10,J27+K27=10),H28+10+L27,H28+J27+K27)))","v":120},null,{"$f":"IF(AND(L27=10,N27=10),J28+20+P27,IF(AND(L27=10,N27<10),J28+10+N27+O27,IF(AND(L27<10,L27+M27=10),J28+10+N27,J28+L27+M27)))","v":150},null,{"$f":"IF(AND(N27=10,P27=10),L28+20+R27,IF(AND(N27=10,P27<10),L28+10+P27+Q27,IF(AND(N27<10,N27+O27=10),L28+10+P27,L28+N27+O27)))","v":180},null,{"$f":"IF(AND(P27=10,R27=10),N28+20+T27,IF(AND(P27=10,R27<10),N28+10+R27+S27,IF(AND(P27<10,P27+Q27=10),N28+10+R27,N28+P27+Q27)))","v":210},null,{"$f":"IF(AND(R27=10,T27=10),P28+20+V27,IF(AND(R27=10,T27<10),P28+10+T27+U27,IF(AND(R27<10,R27+S27=10),P28+10+T27,P28+R27+S27)))","v":240},null,{"$f":"IF(AND(T27=10,V27=10),R28+20+W27,IF(AND(T27=10,V27<10),R28+10+V27+W27,IF(AND(T27<10,T27+U27=10),R28+10+V27,R28+T27+U27)))","v":270},null,{"$f":"T28+V27+W27+X27","v":300}]
[null,null,null,0,{"$f":"IF(D27+E27<10,D27+E27-20,0)","v":0},{"$f":"IF(AND(D27=10,F27=10),10,IF(AND(D27=10,F27+G27<11),F27+G27-10,IF(D27+E27=10,F27-10,0)))","v":10},{"$f":"IF(F27+G27<10,F27+G27-20,0)","v":0},{"$f":"IF(AND(F27=10,H27=10),10,IF(AND(D27=10,F27=10,H27<10),2*H27+I27-20,IF(AND(F27=10,H27+I27<11),H27+I27-10,IF(F27+G27=10,H27-10,0))))","v":10},{"$f":"IF(H27+I27<10,H27+I27-20,0)","v":0},{"$f":"IF(AND(H27=10,J27=10),10,IF(AND(F27=10,H27=10,J27<10),2*J27+K27-20,IF(AND(H27=10,J27+K27<11),J27+K27-10,IF(H27+I27=10,J27-10,0))))","v":10},{"$f":"IF(J27+K27<10,J27+K27-20,0)","v":0},{"$f":"IF(AND(J27=10,L27=10),10,IF(AND(H27=10,J27=10,L27<10),2*L27+M27-20,IF(AND(J27=10,L27+M27<11),L27+M27-10,IF(J27+K27=10,L27-10,0))))","v":10},{"$f":"IF(L27+M27<10,L27+M27-20,0)","v":0},{"$f":"IF(AND(L27=10,N27=10),10,IF(AND(J27=10,L27=10,N27<10),2*N27+O27-20,IF(AND(L27=10,N27+O27<11),N27+O27-10,IF(L27+M27=10,N27-10,0))))","v":10},{"$f":"IF(N27+O27<10,N27+O27-20,0)","v":0},{"$f":"IF(AND(N27=10,P27=10),10,IF(AND(L27=10,N27=10,P27<10),2*P27+Q27-20,IF(AND(N27=10,P27+Q27<11),P27+Q27-10,IF(N27+O27=10,P27-10,0))))","v":10},{"$f":"IF(P27+Q27<10,P27+Q27-20,0)","v":0},{"$f":"IF(AND(P27=10,R27=10),10,IF(AND(N27=10,P27=10,R27<10),2*R27+S27-20,IF(AND(P27=10,R27+S27<11),R27+S27-10,IF(P27+Q27=10,R27-10,0))))","v":10},{"$f":"IF(R27+S27<10,R27+S27-20,0)","v":0},{"$f":"IF(AND(R27=10,T27=10),10,IF(AND(P27=10,R27=10,T27<10),2*T27+U27-20,IF(AND(R27=10,T27+U27<11),T27+U27-10,IF(R27+S27=10,T27-10,0))))","v":10},{"$f":"IF(T27+U27<10,T27+U27-20,0)","v":0},{"$f":"IF(AND(T27=10,V27=10),W27,IF(AND(R27=10,T27=10,V27<10),2*V27+W27-20,IF(AND(T27=10,V27<10),V27+W27-10,IF(T27+U27=10,V27-10,0))))","v":10},{"$f":"V27+W27+X27-20","v":10},null,{"$f":"200+SUM(D30:X30)","v":300}]
[null,null,null,{"$f":"D29+E29","v":0},null,{"$f":"F29+G29","v":10},null,{"$f":"H29+I29","v":10},null,{"$f":"J29+K29","v":10},null,{"$f":"L29+M29","v":10},null,{"$f":"N29+O29","v":10},null,{"$f":"P29+Q29","v":10},null,{"$f":"R29+S29","v":10},null,{"$f":"T29+U29","v":10},null,{"$f":"IF(AND(R27=10,T27=10),IF(V27=10,10,V27-10),IF(T27=10,IF(V27=10,10,0),IF(T27+U27=10,IF(V27=10,0,V27-10),0)))","v":10},{"$f":"IF(W27=10,10,IF(AND(T27=10,V27=10),W27-10,IF(AND(T27=10,V27<10),IF(V27+W27=10,0,2*V27+2*W27-30),IF(V27=10,0,IF(AND(V27<10,V27+W27=10),0,V27+W27-20)))))","v":10},{"$f":"IF(OR(V27+W27=10,V27+W27=20),X27-10,IF(V27=10,W27+X27-10,0))","v":0}]
[null,null,"Player 3",1,null,2,null,3,null,4,null,5,null,6,null,7,null,8,null,9,null,10]
[null,null,{"$f":"スコア!C25","v":0},{"$f":"スコア!EI25","v":10},{"$f":"スコア!EJ25","v":0},{"$f":"スコア!EK25","v":10},{"$f":"スコア!EL25","v":0},{"$f":"スコア!EM25","v":10},{"$f":"スコア!EN25","v":0},{"$f":"スコア!EO25","v":10},{"$f":"スコア!EP25","v":0},{"$f":"スコア!EQ25","v":10},{"$f":"スコア!ER25","v":0},{"$f":"スコア!ES25","v":10},{"$f":"スコア!ET25","v":0},{"$f":"スコア!EU25","v":10},{"$f":"スコア!EV25","v":0},{"$f":"スコア!EW25","v":10},{"$f":"スコア!EX25","v":0},{"$f":"スコア!EY25","v":10},{"$f":"スコア!EZ25","v":0},{"$f":"スコア!FA25","v":10},{"$f":"スコア!FB25","v":10},{"$f":"スコア!FC25","v":10},{"$f":"V33","v":300}]
[null,null,null,{"$f":"IF(AND(D32=10,F32=10),20+H32,IF(AND(D32=10,F32<10),10+F32+G32,IF(AND(D32<10,D32+E32=10),10+F32,D32+E32)))","v":30},null,{"$f":"IF(AND(F32=10,H32=10),D33+20+J32,IF(AND(F32=10,H32<10),D33+10+H32+I32,IF(AND(F32<10,F32+G32=10),D33+10+H32,D33+F32+G32)))","v":60},null,{"$f":"IF(AND(H32=10,J32=10),F33+20+L32,IF(AND(H32=10,J32<10),F33+10+J32+K32,IF(AND(H32<10,H32+I32=10),F33+10+J32,F33+H32+I32)))","v":90},null,{"$f":"IF(AND(J32=10,L32=10),H33+20+N32,IF(AND(J32=10,L32<10),H33+10+L32+M32,IF(AND(J32<10,J32+K32=10),H33+10+L32,H33+J32+K32)))","v":120},null,{"$f":"IF(AND(L32=10,N32=10),J33+20+P32,IF(AND(L32=10,N32<10),J33+10+N32+O32,IF(AND(L32<10,L32+M32=10),J33+10+N32,J33+L32+M32)))","v":150},null,{"$f":"IF(AND(N32=10,P32=10),L33+20+R32,IF(AND(N32=10,P32<10),L33+10+P32+Q32,IF(AND(N32<10,N32+O32=10),L33+10+P32,L33+N32+O32)))","v":180},null,{"$f":"IF(AND(P32=10,R32=10),N33+20+T32,IF(AND(P32=10,R32<10),N33+10+R32+S32,IF(AND(P32<10,P32+Q32=10),N33+10+R32,N33+P32+Q32)))","v":210},null,{"$f":"IF(AND(R32=10,T32=10),P33+20+V32,IF(AND(R32=10,T32<10),P33+10+T32+U32,IF(AND(R32<10,R32+S32=10),P33+10+T32,P33+R32+S32)))","v":240},null,{"$f":"IF(AND(T32=10,V32=10),R33+20+W32,IF(AND(T32=10,V32<10),R33+10+V32+W32,IF(AND(T32<10,T32+U32=10),R33+10+V32,R33+T32+U32)))","v":270},null,{"$f":"T33+V32+W32+X32","v":300}]
[null,null,null,0,{"$f":"IF(D32+E32<10,D32+E32-20,0)","v":0},{"$f":"IF(AND(D32=10,F32=10),10,IF(AND(D32=10,F32+G32<11),F32+G32-10,IF(D32+E32=10,F32-10,0)))","v":10},{"$f":"IF(F32+G32<10,F32+G32-20,0)","v":0},{"$f":"IF(AND(F32=10,H32=10),10,IF(AND(D32=10,F32=10,H32<10),2*H32+I32-20,IF(AND(F32=10,H32+I32<11),H32+I32-10,IF(F32+G32=10,H32-10,0))))","v":10},{"$f":"IF(H32+I32<10,H32+I32-20,0)","v":0},{"$f":"IF(AND(H32=10,J32=10),10,IF(AND(F32=10,H32=10,J32<10),2*J32+K32-20,IF(AND(H32=10,J32+K32<11),J32+K32-10,IF(H32+I32=10,J32-10,0))))","v":10},{"$f":"IF(J32+K32<10,J32+K32-20,0)","v":0},{"$f":"IF(AND(J32=10,L32=10),10,IF(AND(H32=10,J32=10,L32<10),2*L32+M32-20,IF(AND(J32=10,L32+M32<11),L32+M32-10,IF(J32+K32=10,L32-10,0))))","v":10},{"$f":"IF(L32+M32<10,L32+M32-20,0)","v":0},{"$f":"IF(AND(L32=10,N32=10),10,IF(AND(J32=10,L32=10,N32<10),2*N32+O32-20,IF(AND(L32=10,N32+O32<11),N32+O32-10,IF(L32+M32=10,N32-10,0))))","v":10},{"$f":"IF(N32+O32<10,N32+O32-20,0)","v":0},{"$f":"IF(AND(N32=10,P32=10),10,IF(AND(L32=10,N32=10,P32<10),2*P32+Q32-20,IF(AND(N32=10,P32+Q32<11),P32+Q32-10,IF(N32+O32=10,P32-10,0))))","v":10},{"$f":"IF(P32+Q32<10,P32+Q32-20,0)","v":0},{"$f":"IF(AND(P32=10,R32=10),10,IF(AND(N32=10,P32=10,R32<10),2*R32+S32-20,IF(AND(P32=10,R32+S32<11),R32+S32-10,IF(P32+Q32=10,R32-10,0))))","v":10},{"$f":"IF(R32+S32<10,R32+S32-20,0)","v":0},{"$f":"IF(AND(R32=10,T32=10),10,IF(AND(P32=10,R32=10,T32<10),2*T32+U32-20,IF(AND(R32=10,T32+U32<11),T32+U32-10,IF(R32+S32=10,T32-10,0))))","v":10},{"$f":"IF(T32+U32<10,T32+U32-20,0)","v":0},{"$f":"IF(AND(T32=10,V32=10),W32,IF(AND(R32=10,T32=10,V32<10),2*V32+W32-20,IF(AND(T32=10,V32<10),V32+W32-10,IF(T32+U32=10,V32-10,0))))","v":10},{"$f":"V32+W32+X32-20","v":10},null,{"$f":"200+SUM(D35:X35)","v":300}]
[null,null,null,{"$f":"D34+E34","v":0},null,{"$f":"F34+G34","v":10},null,{"$f":"H34+I34","v":10},null,{"$f":"J34+K34","v":10},null,{"$f":"L34+M34","v":10},null,{"$f":"N34+O34","v":10},null,{"$f":"P34+Q34","v":10},null,{"$f":"R34+S34","v":10},null,{"$f":"T34+U34","v":10},null,{"$f":"IF(AND(R32=10,T32=10),IF(V32=10,10,V32-10),IF(T32=10,IF(V32=10,10,0),IF(T32+U32=10,IF(V32=10,0,V32-10),0)))","v":10},{"$f":"IF(W32=10,10,IF(AND(T32=10,V32=10),W32-10,IF(AND(T32=10,V32<10),IF(V32+W32=10,0,2*V32+2*W32-30),IF(V32=10,0,IF(AND(V32<10,V32+W32=10),0,V32+W32-20)))))","v":10},{"$f":"IF(OR(V32+W32=10,V32+W32=20),X32-10,IF(V32=10,W32+X32-10,0))","v":0}]
[null,null,"Player 4",1,null,2,null,3,null,4,null,5,null,6,null,7,null,8,null,9,null,10]
[null,null,{"$f":"スコア!C35","v":0},{"$f":"スコア!EI35","v":10},{"$f":"スコア!EJ35","v":0},{"$f":"スコア!EK35","v":10},{"$f":"スコア!EL35","v":0},{"$f":"スコア!EM35","v":10},{"$f":"スコア!EN35","v":0},{"$f":"スコア!EO35","v":10},{"$f":"スコア!EP35","v":0},{"$f":"スコア!EQ35","v":10},{"$f":"スコア!ER35","v":0},{"$f":"スコア!ES35","v":10},{"$f":"スコア!ET35","v":0},{"$f":"スコア!EU35","v":10},{"$f":"スコア!EV35","v":0},{"$f":"スコア!EW35","v":10},{"$f":"スコア!EX35","v":0},{"$f":"スコア!EY35","v":10},{"$f":"スコア!EZ35","v":0},{"$f":"スコア!FA35","v":10},{"$f":"スコア!FB35","v":10},{"$f":"スコア!FC35","v":10},{"$f":"V38","v":300}]
[null,null,null,{"$f":"IF(AND(D37=10,F37=10),20+H37,IF(AND(D37=10,F37<10),10+F37+G37,IF(AND(D37<10,D37+E37=10),10+F37,D37+E37)))","v":30},null,{"$f":"IF(AND(F37=10,H37=10),D38+20+J37,IF(AND(F37=10,H37<10),D38+10+H37+I37,IF(AND(F37<10,F37+G37=10),D38+10+H37,D38+F37+G37)))","v":60},null,{"$f":"IF(AND(H37=10,J37=10),F38+20+L37,IF(AND(H37=10,J37<10),F38+10+J37+K37,IF(AND(H37<10,H37+I37=10),F38+10+J37,F38+H37+I37)))","v":90},null,{"$f":"IF(AND(J37=10,L37=10),H38+20+N37,IF(AND(J37=10,L37<10),H38+10+L37+M37,IF(AND(J37<10,J37+K37=10),H38+10+L37,H38+J37+K37)))","v":120},null,{"$f":"IF(AND(L37=10,N37=10),J38+20+P37,IF(AND(L37=10,N37<10),J38+10+N37+O37,IF(AND(L37<10,L37+M37=10),J38+10+N37,J38+L37+M37)))","v":150},null,{"$f":"IF(AND(N37=10,P37=10),L38+20+R37,IF(AND(N37=10,P37<10),L38+10+P37+Q37,IF(AND(N37<10,N37+O37=10),L38+10+P37,L38+N37+O37)))","v":180},null,{"$f":"IF(AND(P37=10,R37=10),N38+20+T37,IF(AND(P37=10,R37<10),N38+10+R37+S37,IF(AND(P37<10,P37+Q37=10),N38+10+R37,N38+P37+Q37)))","v":210},null,{"$f":"IF(AND(R37=10,T37=10),P38+20+V37,IF(AND(R37=10,T37<10),P38+10+T37+U37,IF(AND(R37<10,R37+S37=10),P38+10+T37,P38+R37+S37)))","v":240},null,{"$f":"IF(AND(T37=10,V37=10),R38+20+W37,IF(AND(T37=10,V37<10),R38+10+V37+W37,IF(AND(T37<10,T37+U37=10),R38+10+V37,R38+T37+U37)))","v":270},null,{"$f":"T38+V37+W37+X37","v":300}]
[null,null,null,0,{"$f":"IF(D37+E37<10,D37+E37-20,0)","v":0},{"$f":"IF(AND(D37=10,F37=10),10,IF(AND(D37=10,F37+G37<11),F37+G37-10,IF(D37+E37=10,F37-10,0)))","v":10},{"$f":"IF(F37+G37<10,F37+G37-20,0)","v":0},{"$f":"IF(AND(F37=10,H37=10),10,IF(AND(D37=10,F37=10,H37<10),2*H37+I37-20,IF(AND(F37=10,H37+I37<11),H37+I37-10,IF(F37+G37=10,H37-10,0))))","v":10},{"$f":"IF(H37+I37<10,H37+I37-20,0)","v":0},{"$f":"IF(AND(H37=10,J37=10),10,IF(AND(F37=10,H37=10,J37<10),2*J37+K37-20,IF(AND(H37=10,J37+K37<11),J37+K37-10,IF(H37+I37=10,J37-10,0))))","v":10},{"$f":"IF(J37+K37<10,J37+K37-20,0)","v":0},{"$f":"IF(AND(J37=10,L37=10),10,IF(AND(H37=10,J37=10,L37<10),2*L37+M37-20,IF(AND(J37=10,L37+M37<11),L37+M37-10,IF(J37+K37=10,L37-10,0))))","v":10},{"$f":"IF(L37+M37<10,L37+M37-20,0)","v":0},{"$f":"IF(AND(L37=10,N37=10),10,IF(AND(J37=10,L37=10,N37<10),2*N37+O37-20,IF(AND(L37=10,N37+O37<11),N37+O37-10,IF(L37+M37=10,N37-10,0))))","v":10},{"$f":"IF(N37+O37<10,N37+O37-20,0)","v":0},{"$f":"IF(AND(N37=10,P37=10),10,IF(AND(L37=10,N37=10,P37<10),2*P37+Q37-20,IF(AND(N37=10,P37+Q37<11),P37+Q37-10,IF(N37+O37=10,P37-10,0))))","v":10},{"$f":"IF(P37+Q37<10,P37+Q37-20,0)","v":0},{"$f":"IF(AND(P37=10,R37=10),10,IF(AND(N37=10,P37=10,R37<10),2*R37+S37-20,IF(AND(P37=10,R37+S37<11),R37+S37-10,IF(P37+Q37=10,R37-10,0))))","v":10},{"$f":"IF(R37+S37<10,R37+S37-20,0)","v":0},{"$f":"IF(AND(R37=10,T37=10),10,IF(AND(P37=10,R37=10,T37<10),2*T37+U37-20,IF(AND(R37=10,T37+U37<11),T37+U37-10,IF(R37+S37=10,T37-10,0))))","v":10},{"$f":"IF(T37+U37<10,T37+U37-20,0)","v":0},{"$f":"IF(AND(T37=10,V37=10),W37,IF(AND(R37=10,T37=10,V37<10),2*V37+W37-20,IF(AND(T37=10,V37<10),V37+W37-10,IF(T37+U37=10,V37-10,0))))","v":10},{"$f":"V37+W37+X37-20","v":10},null,{"$f":"200+SUM(D40:X40)","v":300}]
[null,null,null,{"$f":"D39+E39","v":0},null,{"$f":"F39+G39","v":10},null,{"$f":"H39+I39","v":10},null,{"$f":"J39+K39","v":10},null,{"$f":"L39+M39","v":10},null,{"$f":"N39+O39","v":10},null,{"$f":"P39+Q39","v":10},null,{"$f":"R39+S39","v":10},null,{"$f":"T39+U39","v":10},null,{"$f":"IF(AND(R37=10,T37=10),IF(V37=10,10,V37-10),IF(T37=10,IF(V37=10,10,0),IF(T37+U37=10,IF(V37=10,0,V37-10),0)))","v":10},{"$f":"IF(W37=10,10,IF(AND(T37=10,V37=10),W37-10,IF(AND(T37=10,V37<10),IF(V37+W37=10,0,2*V37+2*W37-30),IF(V37=10,0,IF(AND(V37<10,V37+W37=10),0,V37+W37-20)))))","v":10},{"$f":"IF(OR(V37+W37=10,V37+W37=20),X37-10,IF(V37=10,W37+X37-10,0))","v":0}]
[null,null,"Player 5",1,null,2,null,3,null,4,null,5,null,6,null,7,null,8,null,9,null,10]
[null,null,{"$f":"スコア!C45","v":0},{"$f":"スコア!EI45","v":10},{"$f":"スコア!EJ45","v":0},{"$f":"スコア!EK45","v":10},{"$f":"スコア!EL45","v":0},{"$f":"スコア!EM45","v":10},{"$f":"スコア!EN45","v":0},{"$f":"スコア!EO45","v":10},{"$f":"スコア!EP45","v":0},{"$f":"スコア!EQ45","v":10},{"$f":"スコア!ER45","v":0},{"$f":"スコア!ES45","v":10},{"$f":"スコア!ET45","v":0},{"$f":"スコア!EU45","v":10},{"$f":"スコア!EV45","v":0},{"$f":"スコア!EW45","v":10},{"$f":"スコア!EX45","v":0},{"$f":"スコア!EY45","v":10},{"$f":"スコア!EZ45","v":0},{"$f":"スコア!FA45","v":10},{"$f":"スコア!FB45","v":10},{"$f":"スコア!FC45","v":10},{"$f":"V43","v":300}]
[null,null,null,{"$f":"IF(AND(D42=10,F42=10),20+H42,IF(AND(D42=10,F42<10),10+F42+G42,IF(AND(D42<10,D42+E42=10),10+F42,D42+E42)))","v":30},null,{"$f":"IF(AND(F42=10,H42=10),D43+20+J42,IF(AND(F42=10,H42<10),D43+10+H42+I42,IF(AND(F42<10,F42+G42=10),D43+10+H42,D43+F42+G42)))","v":60},null,{"$f":"IF(AND(H42=10,J42=10),F43+20+L42,IF(AND(H42=10,J42<10),F43+10+J42+K42,IF(AND(H42<10,H42+I42=10),F43+10+J42,F43+H42+I42)))","v":90},null,{"$f":"IF(AND(J42=10,L42=10),H43+20+N42,IF(AND(J42=10,L42<10),H43+10+L42+M42,IF(AND(J42<10,J42+K42=10),H43+10+L42,H43+J42+K42)))","v":120},null,{"$f":"IF(AND(L42=10,N42=10),J43+20+P42,IF(AND(L42=10,N42<10),J43+10+N42+O42,IF(AND(L42<10,L42+M42=10),J43+10+N42,J43+L42+M42)))","v":150},null,{"$f":"IF(AND(N42=10,P42=10),L43+20+R42,IF(AND(N42=10,P42<10),L43+10+P42+Q42,IF(AND(N42<10,N42+O42=10),L43+10+P42,L43+N42+O42)))","v":180},null,{"$f":"IF(AND(P42=10,R42=10),N43+20+T42,IF(AND(P42=10,R42<10),N43+10+R42+S42,IF(AND(P42<10,P42+Q42=10),N43+10+R42,N43+P42+Q42)))","v":210},null,{"$f":"IF(AND(R42=10,T42=10),P43+20+V42,IF(AND(R42=10,T42<10),P43+10+T42+U42,IF(AND(R42<10,R42+S42=10),P43+10+T42,P43+R42+S42)))","v":240},null,{"$f":"IF(AND(T42=10,V42=10),R43+20+W42,IF(AND(T42=10,V42<10),R43+10+V42+W42,IF(AND(T42<10,T42+U42=10),R43+10+V42,R43+T42+U42)))","v":270},null,{"$f":"T43+V42+W42+X42","v":300}]
[null,null,null,0,{"$f":"IF(D42+E42<10,D42+E42-20,0)","v":0},{"$f":"IF(AND(D42=10,F42=10),10,IF(AND(D42=10,F42+G42<11),F42+G42-10,IF(D42+E42=10,F42-10,0)))","v":10},{"$f":"IF(F42+G42<10,F42+G42-20,0)","v":0},{"$f":"IF(AND(F42=10,H42=10),10,IF(AND(D42=10,F42=10,H42<10),2*H42+I42-20,IF(AND(F42=10,H42+I42<11),H42+I42-10,IF(F42+G42=10,H42-10,0))))","v":10},{"$f":"IF(H42+I42<10,H42+I42-20,0)","v":0},{"$f":"IF(AND(H42=10,J42=10),10,IF(AND(F42=10,H42=10,J42<10),2*J42+K42-20,IF(AND(H42=10,J42+K42<11),J42+K42-10,IF(H42+I42=10,J42-10,0))))","v":10},{"$f":"IF(J42+K42<10,J42+K42-20,0)","v":0},{"$f":"IF(AND(J42=10,L42=10),10,IF(AND(H42=10,J42=10,L42<10),2*L42+M42-20,IF(AND(J42=10,L42+M42<11),L42+M42-10,IF(J42+K42=10,L42-10,0))))","v":10},{"$f":"IF(L42+M42<10,L42+M42-20,0)","v":0},{"$f":"IF(AND(L42=10,N42=10),10,IF(AND(J42=10,L42=10,N42<10),2*N42+O42-20,IF(AND(L42=10,N42+O42<11),N42+O42-10,IF(L42+M42=10,N42-10,0))))","v":10},{"$f":"IF(N42+O42<10,N42+O42-20,0)","v":0},{"$f":"IF(AND(N42=10,P42=10),10,IF(AND(L42=10,N42=10,P42<10),2*P42+Q42-20,IF(AND(N42=10,P42+Q42<11),P42+Q42-10,IF(N42+O42=10,P42-10,0))))","v":10},{"$f":"IF(P42+Q42<10,P42+Q42-20,0)","v":0},{"$f":"IF(AND(P42=10,R42=10),10,IF(AND(N42=10,P42=10,R42<10),2*R42+S42-20,IF(AND(P42=10,R42+S42<11),R42+S42-10,IF(P42+Q42=10,R42-10,0))))","v":10},{"$f":"IF(R42+S42<10,R42+S42-20,0)","v":0},{"$f":"IF(AND(R42=10,T42=10),10,IF(AND(P42=10,R42=10,T42<10),2*T42+U42-20,IF(AND(R42=10,T42+U42<11),T42+U42-10,IF(R42+S42=10,T42-10,0))))","v":10},{"$f":"IF(T42+U42<10,T42+U42-20,0)","v":0},{"$f":"IF(AND(T42=10,V42=10),W42,IF(AND(R42=10,T42=10,V42<10),2*V42+W42-20,IF(AND(T42=10,V42<10),V42+W42-10,IF(T42+U42=10,V42-10,0))))","v":10},{"$f":"V42+W42+X42-20","v":10},null,{"$f":"200+SUM(D45:X45)","v":300}]
[null,null,null,{"$f":"D44+E44","v":0},null,{"$f":"F44+G44","v":10},null,{"$f":"H44+I44","v":10},null,{"$f":"J44+K44","v":10},null,{"$f":"L44+M44","v":10},null,{"$f":"N44+O44","v":10},null,{"$f":"P44+Q44","v":10},null,{"$f":"R44+S44","v":10},null,{"$f":"T44+U44","v":10},null,{"$f":"IF(AND(R42=10,T42=10),IF(V42=10,10,V42-10),IF(T42=10,IF(V42=10,10,0),IF(T42+U42=10,IF(V42=10,0,V42-10),0)))","v":10},{"$f":"IF(W42=10,10,IF(AND(T42=10,V42=10),W42-10,IF(AND(T42=10,V42<10),IF(V42+W42=10,0,2*V42+2*W42-30),IF(V42=10,0,IF(AND(V42<10,V42+W42=10),0,V42+W42-20)))))","v":10},{"$f":"IF(OR(V42+W42=10,V42+W42=20),X42-10,IF(V42=10,W42+X42-10,0))","v":0}]
[]
[null,"相　手　大　学","Player 1",1,null,2,null,3,null,4,null,5,null,6,null,7,null,8,null,9,null,10]
[null,null,{"$f":"スコア!C55","v":0},{"$f":"スコア!EI55","v":10},{"$f":"スコア!EJ55","v":0},{"$f":"スコア!EK55","v":10},{"$f":"スコア!EL55","v":0},{"$f":"スコア!EM55","v":10},{"$f":"スコア!EN55","v":0},{"$f":"スコア!EO55","v":10},{"$f":"スコア!EP55","v":0},{"$f":"スコア!EQ55","v":10},{"$f":"スコア!ER55","v":0},{"$f":"スコア!ES55","v":10},{"$f":"スコア!ET55","v":0},{"$f":"スコア!EU55","v":10},{"$f":"スコア!EV55","v":0},{"$f":"スコア!EW55","v":10},{"$f":"スコア!EX55","v":0},{"$f":"スコア!EY55","v":10},{"$f":"スコア!EZ55","v":0},{"$f":"スコア!FA55","v":10},{"$f":"スコア!FB55","v":10},{"$f":"スコア!FC55","v":10},{"$f":"V49","v":300}]
[null,null,null,{"$f":"IF(AND(D48=10,F48=10),20+H48,IF(AND(D48=10,F48<10),10+F48+G48,IF(AND(D48<10,D48+E48=10),10+F48,D48+E48)))","v":30},null,{"$f":"IF(AND(F48=10,H48=10),D49+20+J48,IF(AND(F48=10,H48<10),D49+10+H48+I48,IF(AND(F48<10,F48+G48=10),D49+10+H48,D49+F48+G48)))","v":60},null,{"$f":"IF(AND(H48=10,J48=10),F49+20+L48,IF(AND(H48=10,J48<10),F49+10+J48+K48,IF(AND(H48<10,H48+I48=10),F49+10+J48,F49+H48+I48)))","v":90},null,{"$f":"IF(AND(J48=10,L48=10),H49+20+N48,IF(AND(J48=10,L48<10),H49+10+L48+M48,IF(AND(J48<10,J48+K48=10),H49+10+L48,H49+J48+K48)))","v":120},null,{"$f":"IF(AND(L48=10,N48=10),J49+20+P48,IF(AND(L48=10,N48<10),J49+10+N48+O48,IF(AND(L48<10,L48+M48=10),J49+10+N48,J49+L48+M48)))","v":150},null,{"$f":"IF(AND(N48=10,P48=10),L49+20+R48,IF(AND(N48=10,P48<10),L49+10+P48+Q48,IF(AND(N48<10,N48+O48=10),L49+10+P48,L49+N48+O48)))","v":180},null,{"$f":"IF(AND(P48=10,R48=10),N49+20+T48,IF(AND(P48=10,R48<10),N49+10+R48+S48,IF(AND(P48<10,P48+Q48=10),N49+10+R48,N49+P48+Q48)))","v":210},null,{"$f":"IF(AND(R48=10,T48=10),P49+20+V48,IF(AND(R48=10,T48<10),P49+10+T48+U48,IF(AND(R48<10,R48+S48=10),P49+10+T48,P49+R48+S48)))","v":240},null,{"$f":"IF(AND(T48=10,V48=10),R49+20+W48,IF(AND(T48=10,V48<10),R49+10+V48+W48,IF(AND(T48<10,T48+U48=10),R49+10+V48,R49+T48+U48)))","v":270},null,{"$f":"T49+V48+W48+X48","v":300}]
[null,null,null,0,{"$f":"IF(D48+E48<10,D48+E48-20,0)","v":0},{"$f":"IF(AND(D48=10,F48=10),10,IF(AND(D48=10,F48+G48<11),F48+G48-10,IF(D48+E48=10,F48-10,0)))","v":10},{"$f":"IF(F48+G48<10,F48+G48-20,0)","v":0},{"$f":"IF(AND(F48=10,H48=10),10,IF(AND(D48=10,F48=10,H48<10),2*H48+I48-20,IF(AND(F48=10,H48+I48<11),H48+I48-10,IF(F48+G48=10,H48-10,0))))","v":10},{"$f":"IF(H48+I48<10,H48+I48-20,0)","v":0},{"$f":"IF(AND(H48=10,J48=10),10,IF(AND(F48=10,H48=10,J48<10),2*J48+K48-20,IF(AND(H48=10,J48+K48<11),J48+K48-10,IF(H48+I48=10,J48-10,0))))","v":10},{"$f":"IF(J48+K48<10,J48+K48-20,0)","v":0},{"$f":"IF(AND(J48=10,L48=10),10,IF(AND(H48=10,J48=10,L48<10),2*L48+M48-20,IF(AND(J48=10,L48+M48<11),L48+M48-10,IF(J48+K48=10,L48-10,0))))","v":10},{"$f":"IF(L48+M48<10,L48+M48-20,0)","v":0},{"$f":"IF(AND(L48=10,N48=10),10,IF(AND(J48=10,L48=10,N48<10),2*N48+O48-20,IF(AND(L48=10,N48+O48<11),N48+O48-10,IF(L48+M48=10,N48-10,0))))","v":10},{"$f":"IF(N48+O48<10,N48+O48-20,0)","v":0},{"$f":"IF(AND(N48=10,P48=10),10,IF(AND(L48=10,N48=10,P48<10),2*P48+Q48-20,IF(AND(N48=10,P48+Q48<11),P48+Q48-10,IF(N48+O48=10,P48-10,0))))","v":10},{"$f":"IF(P48+Q48<10,P48+Q48-20,0)","v":0},{"$f":"IF(AND(P48=10,R48=10),10,IF(AND(N48=10,P48=10,R48<10),2*R48+S48-20,IF(AND(P48=10,R48+S48<11),R48+S48-10,IF(P48+Q48=10,R48-10,0))))","v":10},{"$f":"IF(R48+S48<10,R48+S48-20,0)","v":0},{"$f":"IF(AND(R48=10,T48=10),10,IF(AND(P48=10,R48=10,T48<10),2*T48+U48-20,IF(AND(R48=10,T48+U48<11),T48+U48-10,IF(R48+S48=10,T48-10,0))))","v":10},{"$f":"IF(T48+U48<10,T48+U48-20,0)","v":0},{"$f":"IF(AND(T48=10,V48=10),W48,IF(AND(R48=10,T48=10,V48<10),2*V48+W48-20,IF(AND(T48=10,V48<10),V48+W48-10,IF(T48+U48=10,V48-10,0))))","v":10},{"$f":"V48+W48+X48-20","v":10},null,{"$f":"200+SUM(D51:X51)","v":300}]
[null,null,null,{"$f":"D50+E50","v":0},null,{"$f":"F50+G50","v":10},null,{"$f":"H50+I50","v":10},null,{"$f":"J50+K50","v":10},null,{"$f":"L50+M50","v":10},null,{"$f":"N50+O50","v":10},null,{"$f":"P50+Q50","v":10},null,{"$f":"R50+S50","v":10},null,{"$f":"T50+U50","v":10},null,{"$f":"IF(AND(R48=10,T48=10),IF(V48=10,10,V48-10),IF(T48=10,IF(V48=10,10,0),IF(T48+U48=10,IF(V48=10,0,V48-10),0)))","v":10},{"$f":"IF(W48=10,10,IF(AND(T48=10,V48=10),W48-10,IF(AND(T48=10,V48<10),IF(V48+W48=10,0,2*V48+2*W48-30),IF(V48=10,0,IF(AND(V48<10,V48+W48=10),0,V48+W48-20)))))","v":10},{"$f":"IF(OR(V48+W48=10,V48+W48=20),X48-10,IF(V48=10,W48+X48-10,0))","v":0}]
[null,null,"Player 2",1,null,2,null,3,null,4,null,5,null,6,null,7,null,8,null,9,null,10]
[null,null,{"$f":"スコア!C65","v":0},{"$f":"スコア!EI65","v":10},{"$f":"スコア!EJ65","v":0},{"$f":"スコア!EK65","v":10},{"$f":"スコア!EL65","v":0},{"$f":"スコア!EM65","v":10},{"$f":"スコア!EN65","v":0},{"$f":"スコア!EO65","v":10},{"$f":"スコア!EP65","v":0},{"$f":"スコア!EQ65","v":10},{"$f":"スコア!ER65","v":0},{"$f":"スコア!ES65","v":10},{"$f":"スコア!ET65","v":0},{"$f":"スコア!EU65","v":10},{"$f":"スコア!EV65","v":0},{"$f":"スコア!EW65","v":10},{"$f":"スコア!EX65","v":0},{"$f":"スコア!EY65","v":10},{"$f":"スコア!EZ65","v":0},{"$f":"スコア!FA65","v":10},{"$f":"スコア!FB65","v":10},{"$f":"スコア!FC65","v":10},{"$f":"V54","v":300}]
[null,null,null,{"$f":"IF(AND(D53=10,F53=10),20+H53,IF(AND(D53=10,F53<10),10+F53+G53,IF(AND(D53<10,D53+E53=10),10+F53,D53+E53)))","v":30},null,{"$f":"IF(AND(F53=10,H53=10),D54+20+J53,IF(AND(F53=10,H53<10),D54+10+H53+I53,IF(AND(F53<10,F53+G53=10),D54+10+H53,D54+F53+G53)))","v":60},null,{"$f":"IF(AND(H53=10,J53=10),F54+20+L53,IF(AND(H53=10,J53<10),F54+10+J53+K53,IF(AND(H53<10,H53+I53=10),F54+10+J53,F54+H53+I53)))","v":90},null,{"$f":"IF(AND(J53=10,L53=10),H54+20+N53,IF(AND(J53=10,L53<10),H54+10+L53+M53,IF(AND(J53<10,J53+K53=10),H54+10+L53,H54+J53+K53)))","v":120},null,{"$f":"IF(AND(L53=10,N53=10),J54+20+P53,IF(AND(L53=10,N53<10),J54+10+N53+O53,IF(AND(L53<10,L53+M53=10),J54+10+N53,J54+L53+M53)))","v":150},null,{"$f":"IF(AND(N53=10,P53=10),L54+20+R53,IF(AND(N53=10,P53<10),L54+10+P53+Q53,IF(AND(N53<10,N53+O53=10),L54+10+P53,L54+N53+O53)))","v":180},null,{"$f":"IF(AND(P53=10,R53=10),N54+20+T53,IF(AND(P53=10,R53<10),N54+10+R53+S53,IF(AND(P53<10,P53+Q53=10),N54+10+R53,N54+P53+Q53)))","v":210},null,{"$f":"IF(AND(R53=10,T53=10),P54+20+V53,IF(AND(R53=10,T53<10),P54+10+T53+U53,IF(AND(R53<10,R53+S53=10),P54+10+T53,P54+R53+S53)))","v":240},null,{"$f":"IF(AND(T53=10,V53=10),R54+20+W53,IF(AND(T53=10,V53<10),R54+10+V53+W53,IF(AND(T53<10,T53+U53=10),R54+10+V53,R54+T53+U53)))","v":270},null,{"$f":"T54+V53+W53+X53","v":300}]
[null,null,null,0,{"$f":"IF(D53+E53<10,D53+E53-20,0)","v":0},{"$f":"IF(AND(D53=10,F53=10),10,IF(AND(D53=10,F53+G53<11),F53+G53-10,IF(D53+E53=10,F53-10,0)))","v":10},{"$f":"IF(F53+G53<10,F53+G53-20,0)","v":0},{"$f":"IF(AND(F53=10,H53=10),10,IF(AND(D53=10,F53=10,H53<10),2*H53+I53-20,IF(AND(F53=10,H53+I53<11),H53+I53-10,IF(F53+G53=10,H53-10,0))))","v":10},{"$f":"IF(H53+I53<10,H53+I53-20,0)","v":0},{"$f":"IF(AND(H53=10,J53=10),10,IF(AND(F53=10,H53=10,J53<10),2*J53+K53-20,IF(AND(H53=10,J53+K53<11),J53+K53-10,IF(H53+I53=10,J53-10,0))))","v":10},{"$f":"IF(J53+K53<10,J53+K53-20,0)","v":0},{"$f":"IF(AND(J53=10,L53=10),10,IF(AND(H53=10,J53=10,L53<10),2*L53+M53-20,IF(AND(J53=10,L53+M53<11),L53+M53-10,IF(J53+K53=10,L53-10,0))))","v":10},{"$f":"IF(L53+M53<10,L53+M53-20,0)","v":0},{"$f":"IF(AND(L53=10,N53=10),10,IF(AND(J53=10,L53=10,N53<10),2*N53+O53-20,IF(AND(L53=10,N53+O53<11),N53+O53-10,IF(L53+M53=10,N53-10,0))))","v":10},{"$f":"IF(N53+O53<10,N53+O53-20,0)","v":0},{"$f":"IF(AND(N53=10,P53=10),10,IF(AND(L53=10,N53=10,P53<10),2*P53+Q53-20,IF(AND(N53=10,P53+Q53<11),P53+Q53-10,IF(N53+O53=10,P53-10,0))))","v":10},{"$f":"IF(P53+Q53<10,P53+Q53-20,0)","v":0},{"$f":"IF(AND(P53=10,R53=10),10,IF(AND(N53=10,P53=10,R53<10),2*R53+S53-20,IF(AND(P53=10,R53+S53<11),R53+S53-10,IF(P53+Q53=10,R53-10,0))))","v":10},{"$f":"IF(R53+S53<10,R53+S53-20,0)","v":0},{"$f":"IF(AND(R53=10,T53=10),10,IF(AND(P53=10,R53=10,T53<10),2*T53+U53-20,IF(AND(R53=10,T53+U53<11),T53+U53-10,IF(R53+S53=10,T53-10,0))))","v":10},{"$f":"IF(T53+U53<10,T53+U53-20,0)","v":0},{"$f":"IF(AND(T53=10,V53=10),W53,IF(AND(R53=10,T53=10,V53<10),2*V53+W53-20,IF(AND(T53=10,V53<10),V53+W53-10,IF(T53+U53=10,V53-10,0))))","v":10},{"$f":"V53+W53+X53-20","v":10},null,{"$f":"200+SUM(D56:X56)","v":300}]
[null,null,null,{"$f":"D55+E55","v":0},null,{"$f":"F55+G55","v":10},null,{"$f":"H55+I55","v":10},null,{"$f":"J55+K55","v":10},null,{"$f":"L55+M55","v":10},null,{"$f":"N55+O55","v":10},null,{"$f":"P55+Q55","v":10},null,{"$f":"R55+S55","v":10},null,{"$f":"T55+U55","v":10},null,{"$f":"IF(AND(R53=10,T53=10),IF(V53=10,10,V53-10),IF(T53=10,IF(V53=10,10,0),IF(T53+U53=10,IF(V53=10,0,V53-10),0)))","v":10},{"$f":"IF(W53=10,10,IF(AND(T53=10,V53=10),W53-10,IF(AND(T53=10,V53<10),IF(V53+W53=10,0,2*V53+2*W53-30),IF(V53=10,0,IF(AND(V53<10,V53+W53=10),0,V53+W53-20)))))","v":10},{"$f":"IF(OR(V53+W53=10,V53+W53=20),X53-10,IF(V53=10,W53+X53-10,0))","v":0}]
[null,null,"Player 3",1,null,2,null,3,null,4,null,5,null,6,null,7,null,8,null,9,null,10]
[null,null,{"$f":"スコア!C75","v":0},{"$f":"スコア!EI75","v":10},{"$f":"スコア!EJ75","v":0},{"$f":"スコア!EK75","v":10},{"$f":"スコア!EL75","v":0},{"$f":"スコア!EM75","v":10},{"$f":"スコア!EN75","v":0},{"$f":"スコア!EO75","v":10},{"$f":"スコア!EP75","v":0},{"$f":"スコア!EQ75","v":10},{"$f":"スコア!ER75","v":0},{"$f":"スコア!ES75","v":10},{"$f":"スコア!ET75","v":0},{"$f":"スコア!EU75","v":10},{"$f":"スコア!EV75","v":0},{"$f":"スコア!EW75","v":10},{"$f":"スコア!EX75","v":0},{"$f":"スコア!EY75","v":10},{"$f":"スコア!EZ75","v":0},{"$f":"スコア!FA75","v":10},{"$f":"スコア!FB75","v":10},{"$f":"スコア!FC75","v":10},{"$f":"V59","v":300}]
[null,null,null,{"$f":"IF(AND(D58=10,F58=10),20+H58,IF(AND(D58=10,F58<10),10+F58+G58,IF(AND(D58<10,D58+E58=10),10+F58,D58+E58)))","v":30},null,{"$f":"IF(AND(F58=10,H58=10),D59+20+J58,IF(AND(F58=10,H58<10),D59+10+H58+I58,IF(AND(F58<10,F58+G58=10),D59+10+H58,D59+F58+G58)))","v":60},null,{"$f":"IF(AND(H58=10,J58=10),F59+20+L58,IF(AND(H58=10,J58<10),F59+10+J58+K58,IF(AND(H58<10,H58+I58=10),F59+10+J58,F59+H58+I58)))","v":90},null,{"$f":"IF(AND(J58=10,L58=10),H59+20+N58,IF(AND(J58=10,L58<10),H59+10+L58+M58,IF(AND(J58<10,J58+K58=10),H59+10+L58,H59+J58+K58)))","v":120},null,{"$f":"IF(AND(L58=10,N58=10),J59+20+P58,IF(AND(L58=10,N58<10),J59+10+N58+O58,IF(AND(L58<10,L58+M58=10),J59+10+N58,J59+L58+M58)))","v":150},null,{"$f":"IF(AND(N58=10,P58=10),L59+20+R58,IF(AND(N58=10,P58<10),L59+10+P58+Q58,IF(AND(N58<10,N58+O58=10),L59+10+P58,L59+N58+O58)))","v":180},null,{"$f":"IF(AND(P58=10,R58=10),N59+20+T58,IF(AND(P58=10,R58<10),N59+10+R58+S58,IF(AND(P58<10,P58+Q58=10),N59+10+R58,N59+P58+Q58)))","v":210},null,{"$f":"IF(AND(R58=10,T58=10),P59+20+V58,IF(AND(R58=10,T58<10),P59+10+T58+U58,IF(AND(R58<10,R58+S58=10),P59+10+T58,P59+R58+S58)))","v":240},null,{"$f":"IF(AND(T58=10,V58=10),R59+20+W58,IF(AND(T58=10,V58<10),R59+10+V58+W58,IF(AND(T58<10,T58+U58=10),R59+10+V58,R59+T58+U58)))","v":270},null,{"$f":"T59+V58+W58+X58","v":300}]
[null,null,null,0,{"$f":"IF(D58+E58<10,D58+E58-20,0)","v":0},{"$f":"IF(AND(D58=10,F58=10),10,IF(AND(D58=10,F58+G58<11),F58+G58-10,IF(D58+E58=10,F58-10,0)))","v":10},{"$f":"IF(F58+G58<10,F58+G58-20,0)","v":0},{"$f":"IF(AND(F58=10,H58=10),10,IF(AND(D58=10,F58=10,H58<10),2*H58+I58-20,IF(AND(F58=10,H58+I58<11),H58+I58-10,IF(F58+G58=10,H58-10,0))))","v":10},{"$f":"IF(H58+I58<10,H58+I58-20,0)","v":0},{"$f":"IF(AND(H58=10,J58=10),10,IF(AND(F58=10,H58=10,J58<10),2*J58+K58-20,IF(AND(H58=10,J58+K58<11),J58+K58-10,IF(H58+I58=10,J58-10,0))))","v":10},{"$f":"IF(J58+K58<10,J58+K58-20,0)","v":0},{"$f":"IF(AND(J58=10,L58=10),10,IF(AND(H58=10,J58=10,L58<10),2*L58+M58-20,IF(AND(J58=10,L58+M58<11),L58+M58-10,IF(J58+K58=10,L58-10,0))))","v":10},{"$f":"IF(L58+M58<10,L58+M58-20,0)","v":0},{"$f":"IF(AND(L58=10,N58=10),10,IF(AND(J58=10,L58=10,N58<10),2*N58+O58-20,IF(AND(L58=10,N58+O58<11),N58+O58-10,IF(L58+M58=10,N58-10,0))))","v":10},{"$f":"IF(N58+O58<10,N58+O58-20,0)","v":0},{"$f":"IF(AND(N58=10,P58=10),10,IF(AND(L58=10,N58=10,P58<10),2*P58+Q58-20,IF(AND(N58=10,P58+Q58<11),P58+Q58-10,IF(N58+O58=10,P58-10,0))))","v":10},{"$f":"IF(P58+Q58<10,P58+Q58-20,0)","v":0},{"$f":"IF(AND(P58=10,R58=10),10,IF(AND(N58=10,P58=10,R58<10),2*R58+S58-20,IF(AND(P58=10,R58+S58<11),R58+S58-10,IF(P58+Q58=10,R58-10,0))))","v":10},{"$f":"IF(R58+S58<10,R58+S58-20,0)","v":0},{"$f":"IF(AND(R58=10,T58=10),10,IF(AND(P58=10,R58=10,T58<10),2*T58+U58-20,IF(AND(R58=10,T58+U58<11),T58+U58-10,IF(R58+S58=10,T58-10,0))))","v":10},{"$f":"IF(T58+U58<10,T58+U58-20,0)","v":0},{"$f":"IF(AND(T58=10,V58=10),W58,IF(AND(R58=10,T58=10,V58<10),2*V58+W58-20,IF(AND(T58=10,V58<10),V58+W58-10,IF(T58+U58=10,V58-10,0))))","v":10},{"$f":"V58+W58+X58-20","v":10},null,{"$f":"200+SUM(D61:X61)","v":300}]
[null,null,null,{"$f":"D60+E60","v":0},null,{"$f":"F60+G60","v":10},null,{"$f":"H60+I60","v":10},null,{"$f":"J60+K60","v":10},null,{"$f":"L60+M60","v":10},null,{"$f":"N60+O60","v":10},null,{"$f":"P60+Q60","v":10},null,{"$f":"R60+S60","v":10},null,{"$f":"T60+U60","v":10},null,{"$f":"IF(AND(R58=10,T58=10),IF(V58=10,10,V58-10),IF(T58=10,IF(V58=10,10,0),IF(T58+U58=10,IF(V58=10,0,V58-10),0)))","v":10},{"$f":"IF(W58=10,10,IF(AND(T58=10,V58=10),W58-10,IF(AND(T58=10,V58<10),IF(V58+W58=10,0,2*V58+2*W58-30),IF(V58=10,0,IF(AND(V58<10,V58+W58=10),0,V58+W58-20)))))","v":10},{"$f":"IF(OR(V58+W58=10,V58+W58=20),X58-10,IF(V58=10,W58+X58-10,0))","v":0}]
[null,null,"Player 4",1,null,2,null,3,null,4,null,5,null,6,null,7,null,8,null,9,null,10]
[null,null,{"$f":"スコア!C85","v":0},{"$f":"スコア!EI85","v":10},{"$f":"スコア!EJ85","v":0},{"$f":"スコア!EK85","v":10},{"$f":"スコア!EL85","v":0},{"$f":"スコア!EM85","v":10},{"$f":"スコア!EN85","v":0},{"$f":"スコア!EO85","v":10},{"$f":"スコア!EP85","v":0},{"$f":"スコア!EQ85","v":10},{"$f":"スコア!ER85","v":0},{"$f":"スコア!ES85","v":10},{"$f":"スコア!ET85","v":0},{"$f":"スコア!EU85","v":10},{"$f":"スコア!EV85","v":0},{"$f":"スコア!EW85","v":10},{"$f":"スコア!EX85","v":0},{"$f":"スコア!EY85","v":10},{"$f":"スコア!EZ85","v":0},{"$f":"スコア!FA85","v":10},{"$f":"スコア!FB85","v":10},{"$f":"スコア!FC85","v":10},{"$f":"V64","v":300}]
[null,null,null,{"$f":"IF(AND(D63=10,F63=10),20+H63,IF(AND(D63=10,F63<10),10+F63+G63,IF(AND(D63<10,D63+E63=10),10+F63,D63+E63)))","v":30},null,{"$f":"IF(AND(F63=10,H63=10),D64+20+J63,IF(AND(F63=10,H63<10),D64+10+H63+I63,IF(AND(F63<10,F63+G63=10),D64+10+H63,D64+F63+G63)))","v":60},null,{"$f":"IF(AND(H63=10,J63=10),F64+20+L63,IF(AND(H63=10,J63<10),F64+10+J63+K63,IF(AND(H63<10,H63+I63=10),F64+10+J63,F64+H63+I63)))","v":90},null,{"$f":"IF(AND(J63=10,L63=10),H64+20+N63,IF(AND(J63=10,L63<10),H64+10+L63+M63,IF(AND(J63<10,J63+K63=10),H64+10+L63,H64+J63+K63)))","v":120},null,{"$f":"IF(AND(L63=10,N63=10),J64+20+P63,IF(AND(L63=10,N63<10),J64+10+N63+O63,IF(AND(L63<10,L63+M63=10),J64+10+N63,J64+L63+M63)))","v":150},null,{"$f":"IF(AND(N63=10,P63=10),L64+20+R63,IF(AND(N63=10,P63<10),L64+10+P63+Q63,IF(AND(N63<10,N63+O63=10),L64+10+P63,L64+N63+O63)))","v":180},null,{"$f":"IF(AND(P63=10,R63=10),N64+20+T63,IF(AND(P63=10,R63<10),N64+10+R63+S63,IF(AND(P63<10,P63+Q63=10),N64+10+R63,N64+P63+Q63)))","v":210},null,{"$f":"IF(AND(R63=10,T63=10),P64+20+V63,IF(AND(R63=10,T63<10),P64+10+T63+U63,IF(AND(R63<10,R63+S63=10),P64+10+T63,P64+R63+S63)))","v":240},null,{"$f":"IF(AND(T63=10,V63=10),R64+20+W63,IF(AND(T63=10,V63<10),R64+10+V63+W63,IF(AND(T63<10,T63+U63=10),R64+10+V63,R64+T63+U63)))","v":270},null,{"$f":"T64+V63+W63+X63","v":300}]
[null,null,null,0,{"$f":"IF(D63+E63<10,D63+E63-20,0)","v":0},{"$f":"IF(AND(D63=10,F63=10),10,IF(AND(D63=10,F63+G63<11),F63+G63-10,IF(D63+E63=10,F63-10,0)))","v":10},{"$f":"IF(F63+G63<10,F63+G63-20,0)","v":0},{"$f":"IF(AND(F63=10,H63=10),10,IF(AND(D63=10,F63=10,H63<10),2*H63+I63-20,IF(AND(F63=10,H63+I63<11),H63+I63-10,IF(F63+G63=10,H63-10,0))))","v":10},{"$f":"IF(H63+I63<10,H63+I63-20,0)","v":0},{"$f":"IF(AND(H63=10,J63=10),10,IF(AND(F63=10,H63=10,J63<10),2*J63+K63-20,IF(AND(H63=10,J63+K63<11),J63+K63-10,IF(H63+I63=10,J63-10,0))))","v":10},{"$f":"IF(J63+K63<10,J63+K63-20,0)","v":0},{"$f":"IF(AND(J63=10,L63=10),10,IF(AND(H63=10,J63=10,L63<10),2*L63+M63-20,IF(AND(J63=10,L63+M63<11),L63+M63-10,IF(J63+K63=10,L63-10,0))))","v":10},{"$f":"IF(L63+M63<10,L63+M63-20,0)","v":0},{"$f":"IF(AND(L63=10,N63=10),10,IF(AND(J63=10,L63=10,N63<10),2*N63+O63-20,IF(AND(L63=10,N63+O63<11),N63+O63-10,IF(L63+M63=10,N63-10,0))))","v":10},{"$f":"IF(N63+O63<10,N63+O63-20,0)","v":0},{"$f":"IF(AND(N63=10,P63=10),10,IF(AND(L63=10,N63=10,P63<10),2*P63+Q63-20,IF(AND(N63=10,P63+Q63<11),P63+Q63-10,IF(N63+O63=10,P63-10,0))))","v":10},{"$f":"IF(P63+Q63<10,P63+Q63-20,0)","v":0},{"$f":"IF(AND(P63=10,R63=10),10,IF(AND(N63=10,P63=10,R63<10),2*R63+S63-20,IF(AND(P63=10,R63+S63<11),R63+S63-10,IF(P63+Q63=10,R63-10,0))))","v":10},{"$f":"IF(R63+S63<10,R63+S63-20,0)","v":0},{"$f":"IF(AND(R63=10,T63=10),10,IF(AND(P63=10,R63=10,T63<10),2*T63+U63-20,IF(AND(R63=10,T63+U63<11),T63+U63-10,IF(R63+S63=10,T63-10,0))))","v":10},{"$f":"IF(T63+U63<10,T63+U63-20,0)","v":0},{"$f":"IF(AND(T63=10,V63=10),W63,IF(AND(R63=10,T63=10,V63<10),2*V63+W63-20,IF(AND(T63=10,V63<10),V63+W63-10,IF(T63+U63=10,V63-10,0))))","v":10},{"$f":"V63+W63+X63-20","v":10},null,{"$f":"200+SUM(D66:X66)","v":300}]
[null,null,null,{"$f":"D65+E65","v":0},null,{"$f":"F65+G65","v":10},null,{"$f":"H65+I65","v":10},null,{"$f":"J65+K65","v":10},null,{"$f":"L65+M65","v":10},null,{"$f":"N65+O65","v":10},null,{"$f":"P65+Q65","v":10},null,{"$f":"R65+S65","v":10},null,{"$f":"T65+U65","v":10},null,{"$f":"IF(AND(R63=10,T63=10),IF(V63=10,10,V63-10),IF(T63=10,IF(V63=10,10,0),IF(T63+U63=10,IF(V63=10,0,V63-10),0)))","v":10},{"$f":"IF(W63=10,10,IF(AND(T63=10,V63=10),W63-10,IF(AND(T63=10,V63<10),IF(V63+W63=10,0,2*V63+2*W63-30),IF(V63=10,0,IF(AND(V63<10,V63+W63=10),0,V63+W63-20)))))","v":10},{"$f":"IF(OR(V63+W63=10,V63+W63=20),X63-10,IF(V63=10,W63+X63-10,0))","v":0}]
[null,null,"Player 5",1,null,2,null,3,null,4,null,5,null,6,null,7,null,8,null,9,null,10]
[null,null,{"$f":"スコア!C95","v":0},{"$f":"スコア!EI95","v":10},{"$f":"スコア!EJ95","v":0},{"$f":"スコア!EK95","v":10},{"$f":"スコア!EL95","v":0},{"$f":"スコア!EM95","v":10},{"$f":"スコア!EN95","v":0},{"$f":"スコア!EO95","v":10},{"$f":"スコア!EP95","v":0},{"$f":"スコア!EQ95","v":10},{"$f":"スコア!ER95","v":0},{"$f":"スコア!ES95","v":10},{"$f":"スコア!ET95","v":0},{"$f":"スコア!EU95","v":10},{"$f":"スコア!EV95","v":0},{"$f":"スコア!EW95","v":10},{"$f":"スコア!EX95","v":0},{"$f":"スコア!EY95","v":10},{"$f":"スコア!EZ95","v":0},{"$f":"スコア!FA95","v":10},{"$f":"スコア!FB95","v":10},{"$f":"スコア!FC95","v":10},{"$f":"V69","v":300}]
[null,null,null,{"$f":"IF(AND(D68=10,F68=10),20+H68,IF(AND(D68=10,F68<10),10+F68+G68,IF(AND(D68<10,D68+E68=10),10+F68,D68+E68)))","v":30},null,{"$f":"IF(AND(F68=10,H68=10),D69+20+J68,IF(AND(F68=10,H68<10),D69+10+H68+I68,IF(AND(F68<10,F68+G68=10),D69+10+H68,D69+F68+G68)))","v":60},null,{"$f":"IF(AND(H68=10,J68=10),F69+20+L68,IF(AND(H68=10,J68<10),F69+10+J68+K68,IF(AND(H68<10,H68+I68=10),F69+10+J68,F69+H68+I68)))","v":90},null,{"$f":"IF(AND(J68=10,L68=10),H69+20+N68,IF(AND(J68=10,L68<10),H69+10+L68+M68,IF(AND(J68<10,J68+K68=10),H69+10+L68,H69+J68+K68)))","v":120},null,{"$f":"IF(AND(L68=10,N68=10),J69+20+P68,IF(AND(L68=10,N68<10),J69+10+N68+O68,IF(AND(L68<10,L68+M68=10),J69+10+N68,J69+L68+M68)))","v":150},null,{"$f":"IF(AND(N68=10,P68=10),L69+20+R68,IF(AND(N68=10,P68<10),L69+10+P68+Q68,IF(AND(N68<10,N68+O68=10),L69+10+P68,L69+N68+O68)))","v":180},null,{"$f":"IF(AND(P68=10,R68=10),N69+20+T68,IF(AND(P68=10,R68<10),N69+10+R68+S68,IF(AND(P68<10,P68+Q68=10),N69+10+R68,N69+P68+Q68)))","v":210},null,{"$f":"IF(AND(R68=10,T68=10),P69+20+V68,IF(AND(R68=10,T68<10),P69+10+T68+U68,IF(AND(R68<10,R68+S68=10),P69+10+T68,P69+R68+S68)))","v":240},null,{"$f":"IF(AND(T68=10,V68=10),R69+20+W68,IF(AND(T68=10,V68<10),R69+10+V68+W68,IF(AND(T68<10,T68+U68=10),R69+10+V68,R69+T68+U68)))","v":270},null,{"$f":"T69+V68+W68+X68","v":300}]
[null,null,null,0,{"$f":"IF(D68+E68<10,D68+E68-20,0)","v":0},{"$f":"IF(AND(D68=10,F68=10),10,IF(AND(D68=10,F68+G68<11),F68+G68-10,IF(D68+E68=10,F68-10,0)))","v":10},{"$f":"IF(F68+G68<10,F68+G68-20,0)","v":0},{"$f":"IF(AND(F68=10,H68=10),10,IF(AND(D68=10,F68=10,H68<10),2*H68+I68-20,IF(AND(F68=10,H68+I68<11),H68+I68-10,IF(F68+G68=10,H68-10,0))))","v":10},{"$f":"IF(H68+I68<10,H68+I68-20,0)","v":0},{"$f":"IF(AND(H68=10,J68=10),10,IF(AND(F68=10,H68=10,J68<10),2*J68+K68-20,IF(AND(H68=10,J68+K68<11),J68+K68-10,IF(H68+I68=10,J68-10,0))))","v":10},{"$f":"IF(J68+K68<10,J68+K68-20,0)","v":0},{"$f":"IF(AND(J68=10,L68=10),10,IF(AND(H68=10,J68=10,L68<10),2*L68+M68-20,IF(AND(J68=10,L68+M68<11),L68+M68-10,IF(J68+K68=10,L68-10,0))))","v":10},{"$f":"IF(L68+M68<10,L68+M68-20,0)","v":0},{"$f":"IF(AND(L68=10,N68=10),10,IF(AND(J68=10,L68=10,N68<10),2*N68+O68-20,IF(AND(L68=10,N68+O68<11),N68+O68-10,IF(L68+M68=10,N68-10,0))))","v":10},{"$f":"IF(N68+O68<10,N68+O68-20,0)","v":0},{"$f":"IF(AND(N68=10,P68=10),10,IF(AND(L68=10,N68=10,P68<10),2*P68+Q68-20,IF(AND(N68=10,P68+Q68<11),P68+Q68-10,IF(N68+O68=10,P68-10,0))))","v":10},{"$f":"IF(P68+Q68<10,P68+Q68-20,0)","v":0},{"$f":"IF(AND(P68=10,R68=10),10,IF(AND(N68=10,P68=10,R68<10),2*R68+S68-20,IF(AND(P68=10,R68+S68<11),R68+S68-10,IF(P68+Q68=10,R68-10,0))))","v":10},{"$f":"IF(R68+S68<10,R68+S68-20,0)","v":0},{"$f":"IF(AND(R68=10,T68=10),10,IF(AND(P68=10,R68=10,T68<10),2*T68+U68-20,IF(AND(R68=10,T68+U68<11),T68+U68-10,IF(R68+S68=10,T68-10,0))))","v":10},{"$f":"IF(T68+U68<10,T68+U68-20,0)","v":0},{"$f":"IF(AND(T68=10,V68=10),W68,IF(AND(R68=10,T68=10,V68<10),2*V68+W68-20,IF(AND(T68=10,V68<10),V68+W68-10,IF(T68+U68=10,V68-10,0))))","v":10},{"$f":"V68+W68+X68-20","v":10},null,{"$f":"200+SUM(D71:X71)","v":300}]
[null,null,null,{"$f":"D70+E70","v":0},null,{"$f":"F70+G70","v":10},null,{"$f":"H70+I70","v":10},null,{"$f":"J70+K70","v":10},null,{"$f":"L70+M70","v":10},null,{"$f":"N70+O70","v":10},null,{"$f":"P70+Q70","v":10},null,{"$f":"R70+S70","v":10},null,{"$f":"T70+U70","v":10},null,{"$f":"IF(AND(R68=10,T68=10),IF(V68=10,10,V68-10),IF(T68=10,IF(V68=10,10,0),IF(T68+U68=10,IF(V68=10,0,V68-10),0)))","v":10},{"$f":"IF(W68=10,10,IF(AND(T68=10,V68=10),W68-10,IF(AND(T68=10,V68<10),IF(V68+W68=10,0,2*V68+2*W68-30),IF(V68=10,0,IF(AND(V68<10,V68+W68=10),0,V68+W68-20)))))","v":10},{"$f":"IF(OR(V68+W68=10,V68+W68=20),X68-10,IF(V68=10,W68+X68-10,0))","v":0}]
[]
[]
[null,null,null,null,null,null,null,null,null,null,null,null,null,null,null,null,null,null,null,null,null,null,"(C) 2017 Hitoshi Saigo"]

{"sheet":"点差推移","index":2,"n_rows":63,"n_cols":16,"rows_kept":63,"cut":false,"hidden":false,"merged":[[27,2,31,2],[2,2,6,2],[7,2,11,2],[12,2,16,2],[17,2,21,2],[22,2,26,2],[62,15,62,17],[32,2,36,2],[37,2,41,2],[42,2,46,2],[47,2,61,2]]}
[]
[null,null,"フレーム","投目","点差"]
[null,0.2,1,1,{"$f":"点差計算!D3","v":0}]
[null,0.4,null,2,{"$f":"点差計算!D4","v":0}]
[null,0.6,null,3,{"$f":"点差計算!D5","v":0}]
[null,0.8,null,4,{"$f":"点差計算!D6","v":0}]
[null,1,null,5,{"$f":"点差計算!D7","v":0}]
[null,1.2,2,1,{"$f":"点差計算!F3","v":0}]
[null,1.4,null,2,{"$f":"点差計算!F4","v":0}]
[null,1.6,null,3,{"$f":"点差計算!F5","v":0}]
[null,1.8,null,4,{"$f":"点差計算!F6","v":0}]
[null,2,null,5,{"$f":"点差計算!F7","v":0}]
[null,2.2000000000000002,3,1,{"$f":"点差計算!H3","v":0}]
[null,2.4,null,2,{"$f":"点差計算!H4","v":0}]
[null,2.6,null,3,{"$f":"点差計算!H5","v":0}]
[null,2.8,null,4,{"$f":"点差計算!H6","v":0}]
[null,3,null,5,{"$f":"点差計算!H7","v":0}]
[null,3.2,4,1,{"$f":"点差計算!J3","v":0}]
[null,3.4,null,2,{"$f":"点差計算!J4","v":0}]
[null,3.6,null,3,{"$f":"点差計算!J5","v":0}]
[null,3.8,null,4,{"$f":"点差計算!J6","v":0}]
[null,4,null,5,{"$f":"点差計算!J7","v":0}]
[null,4.2,5,1,{"$f":"点差計算!L3","v":0}]
[null,4.4000000000000004,null,2,{"$f":"点差計算!L4","v":0}]
[null,4.5999999999999996,null,3,{"$f":"点差計算!L5","v":0}]
[null,4.8,null,4,{"$f":"点差計算!L6","v":0}]
[null,5,null,5,{"$f":"点差計算!L7","v":0}]
[null,5.2,6,1,{"$f":"点差計算!N3","v":0}]
[null,5.4,null,2,{"$f":"点差計算!N4","v":0}]
[null,5.6,null,3,{"$f":"点差計算!N5","v":0}]
[null,5.8,null,4,{"$f":"点差計算!N6","v":0}]
[null,6,null,5,{"$f":"点差計算!N7","v":0}]
[null,6.2,7,1,{"$f":"点差計算!P3","v":0}]
[null,6.4,null,2,{"$f":"点差計算!P4","v":0}]
[null,6.6,null,3,{"$f":"点差計算!P5","v":0}]
[null,6.8,null,4,{"$f":"点差計算!P6","v":0}]
[null,7,null,5,{"$f":"点差計算!P7","v":0}]
[null,7.2,8,1,{"$f":"点差計算!R3","v":0}]
[null,7.4,null,2,{"$f":"点差計算!R4","v":0}]
[null,7.6,null,3,{"$f":"点差計算!R5","v":0}]
[null,7.8,null,4,{"$f":"点差計算!R6","v":0}]
[null,8,null,5,{"$f":"点差計算!R7","v":0}]
[null,8.1999999999999993,9,1,{"$f":"点差計算!T3","v":0}]
[null,8.4,null,2,{"$f":"点差計算!T4","v":0}]
[null,8.6,null,3,{"$f":"点差計算!T5","v":0}]
[null,8.8000000000000007,null,4,{"$f":"点差計算!T6","v":0}]
[null,9,null,5,{"$f":"点差計算!T7","v":0}]
[null,{"$f":"B47+1/15","v":9.0666666666666664},10,"1-1",{"$f":"点差計算!V3","v":0}]
[null,{"$f":"B48+1/15","v":9.1333333333333329},null,"1-2",{"$f":"点差計算!X3","v":0}]
[null,9.1999999999999993,null,"1-3",{"$f":"点差計算!Z3","v":0}]
[null,9.2666666666666657,null,"2-1",{"$f":"点差計算!V4","v":0}]
[null,9.3333333333333321,null,"2-2",{"$f":"点差計算!X4","v":0}]
[null,9.3999999999999986,null,"2-3",{"$f":"点差計算!Z4","v":0}]
[null,9.466666666666665,null,"3-1",{"$f":"点差計算!V5","v":0}]
[null,9.5333333333333314,null,"3-2",{"$f":"点差計算!X5","v":0}]
[null,9.5999999999999979,null,"3-3",{"$f":"点差計算!Z5","v":0}]
[null,9.6666666666666643,null,"4-1",{"$f":"点差計算!V6","v":0}]
[null,9.7333333333333307,null,"4-2",{"$f":"点差計算!X6","v":0}]
[null,9.7999999999999972,null,"4-3",{"$f":"点差計算!Z6","v":0}]
[null,9.8666666666666636,null,"5-1",{"$f":"点差計算!V7","v":0}]
[null,9.93333333333333,null,"5-2",{"$f":"点差計算!X7","v":0}]
[null,9.9999999999999964,null,"5-3",{"$f":"点差計算!Z7","v":0}]
[null,null,null,null,null,null,null,null,null,null,null,null,null,null,null,"(C) 2017 Hitoshi Saigo"]